program: Orca
programVersion: 5.0.3
elementType: C H C H C C C H H C H H C C H H H H H H H
charge: 1
multiplicity: 1
keywords: PBE0 cc-pVTZ EnGrad D3BJ RIJCOSX verytightscf cc-pVTZ/C def2/J soscf
formula: C8H13
InChI: InChI=1/C8H13/c1-2-4-6-8-7-5-3-1/h1-2,7H,3-6,8H2
21 atoms
C  -1.990231 0.57807 0.093965
H  -2.167188 0.756345 1.16036
C  -1.844675 -0.964297 -0.17376
H  -2.655794 -1.504393 0.322506
C  -0.450702 -1.28984 0.34227
C  0.644319 -1.226883 -0.448956
C  1.937309 -0.691986 0.07266
H  2.093874 -0.944794 1.126492
H  2.805835 -1.036366 -0.49858
C  1.831047 0.858721 -0.093453
H  1.879957 1.120017 -1.156993
H  2.670784 1.357881 0.398417
C  0.495765 1.434763 0.511443
C  -0.666596 1.131117 -0.317006
H  0.527409 -1.280629 -1.532779
H  -1.908151 -1.16081 -1.248941
H  0.352162 1.13967 1.553877
H  -0.561298 1.385266 -1.376575
H  -2.808834 1.005509 -0.495352
H  0.62172 2.535776 0.477827
H  -0.323442 -1.306733 1.425975
totalener: -312.05537520 hartree
nucrepener: 380.71557919 hartree
electener: -692.77095439 hartree
oneelecener: -1162.42138283 hartree
twoeener: 469.65042844 hartree
kineticenergy: 309.63440545 hartree
exchangeener: -34.152323414673 hartree
correlationener: -1.963084889577 hartree
xcener: -36.115408304250 hartree
chargesum: 1.0000000
charge: -0.160830 0.154860 -0.169509 0.152645 -0.110323 -0.128457 -0.172160 0.140871 0.153943 -0.196488 0.138532 0.153981 -0.172249 0.036693 0.172224 0.144890 0.149792 0.203803 0.161178 0.184423 0.162179
charge: 0.089921 0.008391 0.092380 0.000365 0.096884 0.074448 0.072032 0.000056 0.007308 0.110123 -0.006020 0.000663 0.071245 0.331532 -0.012220 0.001382 0.004990 0.014513 0.010131 0.043159 -0.011284
qa: -0.1608 0.1549 -0.1695 0.1526 -0.1103 -0.1285 -0.1722 0.1409 0.1539 -0.1965 0.1385 0.1540 -0.1722 0.0367 0.1722 0.1449 0.1498 0.2038 0.1612 0.1844 0.1622
va: 3.8353 0.9902 3.8820 0.9867 3.8245 3.8335 3.8858 0.9940 0.9878 3.8652 0.9903 0.9852 3.8859 3.5899 0.9858 0.9936 0.9938 0.9727 0.9869 0.9784 0.9935
dispcorr: -0.018893242 hartree
energy: -312.074268445314
dipole: 0.49383 -0.87411 -0.38028 1.93479 -1.01118 0.92361 0.14621 -0.26860 -0.12239
magnitude: 1.00630 au
magnitude: 2.55782 debye
