program: Orca
programVersion: 5.0.3
charge: 1
multiplicity: 1
keywords: DLPNO-CCSD(T1) tightPNO Extrapolate(3/4,def2) RIJK def2/JK verytightSCF miniprint nopop
formula: C8H13
InChI: InChI=1/C8H13/c1-2-4-6-8-7-5-3-1/h1-2,7H,3-6,8H2
21 atoms
C  -2.000738 0.730318 0.078921
H  -2.199462 0.869744 1.145226
C  -1.75565 -0.933399 -0.145394
H  -2.618636 -1.353864 0.375991
C  -0.428354 -1.361938 0.406821
C  0.696382 -1.284647 -0.365152
C  2.008077 -0.687227 0.069193
H  2.221267 -0.878634 1.126457
H  2.859091 -1.023406 -0.527376
C  1.800251 0.894048 -0.144611
H  1.858702 1.132068 -1.211881
H  2.613203 1.424268 0.355752
C  0.423937 1.265748 0.444152
C  -0.748253 1.319449 -0.373556
H  0.530491 -1.21103 -1.444513
H  -1.848183 -1.125879 -1.216163
H  0.091483 0.238387 0.833051
H  -0.613855 1.369678 -1.458239
H  -2.870311 0.989498 -0.525767
H  0.375466 1.775262 1.416772
H  -0.347237 -1.517468 1.484676
e0: -310.238420694 hartree
corrType: DLPNO BASED
e0: -310.252028000 hartree
basis: def2-TZVPP def2-QZVPP
scfener: -310.238420694 -310.252028000
corrmethod: MDCI MDCI
correner: -1.466791752 -1.537136053
corrcbsextra: -1.589242904
energy: -311.843145155381
dipole: 0.04878 -0.73946 -0.69068 0.64586 0.34933 0.99518 0.33199 -0.47522 -0.14323
magnitude: 1.21981 au
magnitude: 3.10052 debye
