program: Gaussian 09
title: 000051155
version: EM64L-G09RevD.01
frameworkgroup: C1[X(C14H18N2O3S)]
method: RPBEPBE
basis: SDD
operation: Freq
keyword: #p
keyword: freq=noraman
keyword: PBEPBE/SDD
title: #p freq=noraman PBEPBE/SDD
converged: YES YES NO NO
title: Mulliken charges:
elementType: S O O O N N C C C C C C C C C C C C C C H H H H H H H H H H H H H H H H H H
charge: 0.007584 -0.307173 -0.289514 -0.307638 -0.174791 -0.077296 -0.360132 -0.497890 0.251831 -0.458507 0.557482 -0.720228 -0.532410 -0.531969 0.283741 0.244855 0.037138 -0.526198 -0.524100 -0.524962 0.254287 0.256719 0.238405 0.239151 0.267153 0.240944 0.246763 0.277116 0.288921 0.229644 0.231774 0.247838 0.263137 0.230402 0.217422 0.230618 0.229802 0.260081
chargesum: 0.00000
title: Mulliken charges with hydrogens summed into heavy atoms:
elementType: S O O O N N C C C C C C C C C C C C C C
charge: 0.007584 -0.307173 -0.289514 -0.307638 -0.174791 -0.077296 0.150874 -0.020334 0.251831 -0.458507 0.557482 0.034632 -0.255294 -0.243048 0.283741 0.244855 0.037138 0.183058 0.186862 0.195538
polarizability: 2.78718687e+02 2.85731267e-01 2.06555129e+02 -4.47607157e+00 -1.28994945e+01 1.45596460e+02
1716.lowfreq: -5.9261 0.0007 0.0008 0.0014 4.7390 14.0610 27.2871 45.3788 47.8176
frequency: 27.0234 45.3248 47.8123 71.4067 81.0760 84.8318 91.1736 100.0946 128.0314 154.5209 161.2463 162.6015 169.6545 177.1337 195.2592 207.1447 222.1473 242.0232 250.5393 253.5927 280.9836 297.2881 326.3972 365.0446 380.5714 416.5394 436.0006 482.1544 517.5197 547.9509 592.7266 616.2338 632.9867 638.3142 649.4759 682.9273 714.6175 760.3350 772.4768 841.6531 865.5676 887.6144 898.3070 902.6268 905.1033 939.7774 951.9171 987.9456 999.1498 1032.3504 1042.6898 1050.9049 1070.6433 1080.3888 1111.1951 1113.5758 1114.9626 1138.5183 1151.3324 1157.7693 1161.8879 1177.6813 1200.4578 1207.9771 1217.0129 1238.8621 1300.4130 1303.2034 1331.2861 1353.7097 1362.1127 1390.8334 1398.5839 1418.5138 1434.0029 1436.0765 1447.9470 1448.7160 1454.1951 1458.5515 1459.7898 1463.7393 1469.4804 1477.7475 1481.2230 1484.8260 1486.7068 1556.5379 1596.6472 1611.4138 2975.4662 2977.5593 2982.0472 3003.7406 3008.4468 3026.7414 3072.8334 3072.9088 3083.9457 3085.5473 3098.6573 3102.5299 3123.5089 3124.6364 3125.8627 3129.6512 3159.0178 3173.6099
redmass: 6.0505 3.4711 4.4739 3.2610 3.3169 2.9864 3.3079 2.6965 2.7278 1.3708 1.4857 1.2438 1.8103 1.3463 2.8106 2.9651 3.3036 3.8963 4.7414 2.8161 5.6939 6.7746 4.2423 4.8602 5.0619 5.5635 5.9670 5.3783 5.6279 6.7432 3.6012 4.9315 5.0710 5.4358 4.9361 5.2812 3.4014 4.7754 4.7594 1.6476 6.2672 3.7330 1.9985 1.7684 2.3597 8.6888 5.0437 3.5642 6.2242 4.7139 1.9517 2.2426 2.1324 1.7308 1.2384 1.2452 1.2384 2.6359 1.3575 1.5223 1.7991 1.1517 2.0319 1.4594 1.1678 3.5379 4.7731 1.4808 1.6031 5.3181 7.5351 3.0914 1.2378 1.3403 1.3279 1.2974 1.0977 1.0514 1.3376 1.0755 1.1129 1.5423 1.0919 1.0599 1.0921 1.0537 1.0552 7.5273 6.9785 7.1747 1.0304 1.0334 1.0298 1.0648 1.0364 1.0617 1.0991 1.1043 1.1045 1.0994 1.0968 1.1063 1.1027 1.1013 1.1037 1.1045 1.0916 1.0923
irintensity: 0.7433 0.5336 2.6221 1.4142 0.6442 1.4364 5.0319 10.0773 2.3882 1.5402 0.8401 0.5284 0.5939 0.9158 1.2747 9.4461 5.9976 3.6522 7.6083 7.3154 12.4249 4.6399 4.8683 4.6231 0.9039 2.0547 3.9722 7.9536 0.6557 7.9326 1.6159 14.0515 18.7601 4.7314 12.7639 3.0020 1.8334 1.0997 9.9549 1.1357 6.5984 58.2665 27.7972 13.7793 47.9722 65.7685 38.2352 22.2560 64.3233 145.8375 34.5619 1.6425 9.9256 1.3008 8.5712 17.8101 2.9936 34.5228 2.7573 18.9089 19.6305 5.1812 37.5003 9.5769 8.3289 210.3158 199.4615 62.6432 13.0976 46.3259 438.4713 93.0005 44.2651 2.5084 16.6609 27.0521 39.1106 18.4941 32.3981 23.7382 2.9558 10.4901 6.1394 4.8783 11.6306 16.4241 30.7660 82.5192 3.1399 69.2199 56.9096 100.3658 64.0575 43.1526 8.8600 21.7785 10.4075 30.3801 18.3815 30.8437 5.4797 17.5614 24.5407 16.4807 21.5627 14.9604 1.9292 0.7494
temp: 298.150 k
press: 1.00000 atm
elementType: 16 8 8 8 7 7 6 6 6 6 6 6 6 6 6 6 6 6 6 6 1 1 1 1 1 1 1 1 1 1 1 1 1 1 1 1 1 1
symmnumber: 1
zpe: 785851.0 jmol-1
zpe.correction: 0.299315 hartree
zpe.thermalcorrener: 0.320736 hartree
zpe.thermalcorrenthalpy: 0.321681 hartree
zpe.thermalcorrgfe: 0.248130 hartree
zpe.sumelectzpe: -1275.953300 hartree
zpe.sumelectthermal: -1275.931878 hartree
zpe.sumelectthermalent: -1275.930934 hartree
zpe.sumelectthermalfe: -1276.004484 hartree
dipole: -4.6368 -2.1049 0.8330
dipole: 5.1599
quadrupole: -121.7622 -127.8803 -119.0340
quadrupole: -2.9578 0.5642 0.2458
quadrupole: 1.1300 -4.9881 3.8581 -2.9578 0.5642 0.2458
hfenergy: -1276.2526144 hartree
pointgroup: C01 [X(C14H18N2O3S1)]
dipole: -1.7698545 0.5936358 -0.7977621 debye
polarizability: 277.7557688|3.1538286|182.4063519|11.0081432|-32.3775723|170.7081558 unknown
InChI: InChI=1S/C14H18N2O3S/c1-9-15-5-6-16(9)14(20)10-7-11(17-2)13(19-4)12(8-10)18-3/h7-8H,5-6H2,1-4H3
charge 0 multiplicity 1
38 atoms
S  2.148228 -1.690819 1.981558
O  -2.784501 -2.329852 -0.170171
O  -1.772707 2.51029 -0.516455
O  -3.699423 0.360737 -0.696251
N  2.763163 -0.068498 -0.161564
N  4.874978 0.41055 -0.988347
C  2.511794 0.32885 -1.594819
C  3.956995 0.382096 -2.170389
C  4.181168 0.11502 0.08559
C  1.806316 -0.679307 0.637239
C  0.380184 -0.413412 0.265358
C  4.793863 0.068901 1.455197
C  -0.074722 0.912589 0.046882
C  -0.551806 -1.480335 0.224156
C  -1.902444 -1.228239 -0.075903
C  -1.431611 1.174725 -0.24421
C  -2.356096 0.09597 -0.349501
C  -3.863722 -2.346784 0.846539
C  -2.924398 3.079185 0.221068
C  -4.118287 -0.216294 -2.000216
H  2.020631 1.314935 -1.642113
H  1.860256 -0.412826 -2.082249
H  4.197311 -0.507395 -2.783038
H  4.127531 1.276059 -2.792365
H  4.881125 -0.96711 1.819877
H  4.173528 0.607968 2.191597
H  5.792663 0.528294 1.391726
H  0.600364 1.769503 0.132462
H  -0.232615 -2.503283 0.440842
H  -3.426836 -2.427331 1.859446
H  -4.460158 -3.244104 0.622751
H  -4.488556 -1.438294 0.77474
H  -3.842051 2.502863 0.020595
H  -3.019444 4.109682 -0.153105
H  -2.708924 3.091968 1.306727
H  -3.536002 0.245058 -2.818719
H  -5.183678 0.039527 -2.10303
H  -3.978315 -1.311386 -1.999806
