program: Orca
programVersion: 5.0.3
elementType: C H C H C C C H H C H H C C H H H H H H H
charge: 1
multiplicity: 1
keywords: b3lyp cc-pVTZ EnGrad RIJCOSX verytightscf cc-pVTZ/C def2/J soscf
formula: C8H13
InChI: InChI=1/C8H13/c1-2-4-6-8-7-5-3-1/h1-2,7H,3-6,8H2
21 atoms
C  -1.995967 0.535077 0.119647
H  -2.172473 0.725128 1.181986
C  -1.939149 -0.991995 -0.172408
H  -2.674167 -1.57969 0.3806
C  -0.507723 -1.166117 0.289423
C  0.615254 -1.141092 -0.497458
C  1.909629 -0.658405 0.067557
H  2.01632 -0.951618 1.117353
H  2.769241 -1.043285 -0.488166
C  1.883066 0.90487 -0.0442
H  1.993525 1.1912 -1.096864
H  2.733336 1.332326 0.493927
C  0.550293 1.481117 0.495134
C  -0.565357 0.873116 -0.273511
H  0.532917 -1.3058 -1.571456
H  -2.045514 -1.195955 -1.242148
H  0.429373 1.33886 1.573688
H  -0.433015 0.937214 -1.356526
H  -2.733235 1.085574 -0.474388
H  0.544408 2.567662 0.304009
H  -0.359879 -1.117185 1.369706
totalener: -312.24778475 hartree
nucrepener: 384.62672897 hartree
electener: -696.87451372 hartree
oneelecener: -1170.14618816 hartree
twoeener: 473.27167444 hartree
kineticenergy: 309.99679946 hartree
exchangeener: -36.318123773161 hartree
correlationener: -2.307922050582 hartree
xcener: -38.626045823742 hartree
chargesum: 1.0000000
charge: -0.163014 0.141422 -0.170039 0.153459 -0.046674 -0.053513 -0.185739 0.134938 0.153979 -0.188771 0.131342 0.152567 -0.166337 -0.021110 0.185206 0.137848 0.136615 0.179045 0.154354 0.170635 0.163789
charge: 0.096473 -0.000846 0.100735 -0.002126 0.125992 0.146826 0.083496 -0.000308 0.005496 0.102577 -0.007195 -0.001291 0.069837 0.253017 -0.003789 -0.001352 -0.001252 0.002172 0.001745 0.026825 0.002967
qa: -0.1630 0.1414 -0.1700 0.1535 -0.0467 -0.0535 -0.1857 0.1349 0.1540 -0.1888 0.1313 0.1526 -0.1663 -0.0211 0.1852 0.1378 0.1366 0.1790 0.1544 0.1706 0.1638
va: 3.8238 0.9914 3.8402 0.9832 3.7700 3.7662 3.8738 0.9910 0.9832 3.8384 0.9881 0.9805 3.8499 3.6565 0.9782 0.9931 0.9913 0.9876 0.9815 0.9751 0.9928
energy: -312.247784752174
dipole: 0.56306 -0.75367 -0.19061 1.85757 -1.62272 0.23485 0.17950 -0.31982 -0.14031
magnitude: 0.33343 au
magnitude: 0.84751 debye
