program: Gaussian 09
title: 000051100
version: EM64L-G09RevD.01
frameworkgroup: C1[X(C13H15N5O)]
method: RPBEPBE
basis: SDD
operation: Freq
keyword: #p
keyword: freq=noraman
keyword: PBEPBE/SDD
title: #p freq=noraman PBEPBE/SDD
converged: YES YES NO NO
title: Mulliken charges:
elementType: O N N N N N C C C C C C C C C C C C C H H H H H H H H H H H H H H H
charge: -0.234551 -0.373311 -0.312012 -0.090220 -0.102419 -0.039336 -0.189638 -0.677971 -0.681640 0.261232 0.335990 0.177741 0.034597 -0.354957 -0.347263 -0.384688 -0.235023 -0.226638 -0.229631 0.198033 0.217370 0.245140 0.217293 0.219052 0.214600 0.246264 0.322110 0.348179 0.227109 0.267080 0.248115 0.232768 0.231905 0.234719
chargesum: 0.00000
title: Mulliken charges with hydrogens summed into heavy atoms:
elementType: O N N N N N C C C C C C C C C C C C C
charge: -0.234551 -0.051200 0.036166 -0.090220 -0.102419 -0.039336 0.008395 0.001833 -0.001723 0.261232 0.335990 0.177741 0.034597 -0.127848 -0.080184 -0.136573 -0.002254 0.005267 0.005087
polarizability: 2.40310620e+02 -2.11968147e+01 2.15784161e+02 1.20352275e+01 8.80927723e+00 1.02524508e+02
1716.lowfreq: -0.5725 -0.0002 0.0002 0.0006 4.4656 5.4648 18.8690 26.4437 34.6740
frequency: 18.7953 26.3418 34.5584 40.2189 43.6350 91.9406 112.5214 128.1152 186.2770 199.2030 208.3319 227.1847 254.7997 274.6685 284.9919 314.3697 319.2337 400.6578 403.7883 409.8697 440.4365 461.1881 497.4110 538.6055 571.3726 612.0114 620.2577 650.0614 660.0138 671.3881 695.4173 720.5547 732.6432 769.2978 791.6665 852.5475 862.6780 870.2311 905.8910 921.2542 923.1996 940.3284 960.4771 964.4995 987.2770 990.1033 1006.1840 1025.1571 1050.7192 1077.6392 1091.2408 1097.0474 1103.6297 1111.9453 1126.8202 1174.6269 1182.6100 1190.9624 1241.8308 1288.4099 1289.2126 1305.6270 1315.8915 1350.9579 1375.9207 1383.2210 1394.7478 1413.3248 1439.0220 1449.8962 1457.4080 1460.8791 1471.2501 1476.2631 1478.9947 1490.4213 1494.2564 1516.9751 1587.6645 1612.7755 1645.0188 2973.3918 2983.2815 2987.3671 3077.7574 3083.8055 3091.9309 3098.0977 3130.6067 3139.2038 3151.4000 3162.6633 3172.3129 3185.5277 3526.3686 3538.7046
redmass: 3.4330 3.7993 5.4040 3.7713 4.9804 6.7380 4.8377 5.4058 1.3370 2.1695 1.6367 4.0788 1.9751 3.9644 3.1884 5.3045 6.8733 2.7924 3.3614 4.9685 3.6896 1.6352 2.9369 4.8658 1.4522 6.7843 7.5929 3.2093 4.7043 4.5854 1.6715 5.6209 6.6971 3.6519 2.0357 1.3361 3.3870 1.5411 7.9625 2.4411 1.3051 1.4445 7.9717 1.4604 1.4926 4.7318 1.3421 2.3495 5.1535 1.9654 1.6665 2.4164 3.1220 2.8296 4.3254 1.0644 1.9440 1.1342 4.1437 2.8265 1.3709 1.7320 1.4077 1.6472 1.1923 6.0740 1.2010 4.1417 1.9019 1.5624 3.0031 1.0450 1.0528 1.0639 2.5229 1.0668 3.4961 3.7341 6.1336 6.0476 7.0449 1.0805 1.0357 1.0373 1.1003 1.1000 1.1010 1.1001 1.0851 1.0882 1.0932 1.0958 1.1003 1.0921 1.0796 1.0770
irintensity: 1.3584 0.4170 4.6326 0.9932 0.6169 0.3794 0.9818 4.5238 1.9341 3.8591 2.2295 0.8021 1.4355 5.0813 2.1790 11.3794 2.3409 0.0573 4.8014 0.9661 5.2565 11.3773 25.9443 5.6700 189.5365 2.1071 3.9339 21.1759 10.9272 14.0839 51.2383 6.6483 5.8104 32.4821 28.4315 2.5415 2.4017 12.7085 7.5880 5.4663 10.7713 2.3970 12.9405 0.2989 1.1688 0.1444 0.5274 19.6830 67.0818 9.4933 20.6673 3.7995 53.3251 20.3584 64.4240 0.8657 9.7069 13.1157 62.7838 49.6481 0.2169 13.0180 1.2926 10.3492 11.4631 3.8513 20.1215 8.5456 29.4661 116.8812 25.4074 4.1078 0.8117 22.3995 181.3945 28.6351 392.7391 195.1184 0.1686 8.6785 118.1063 33.5173 29.3094 26.7939 36.8004 41.4973 4.0793 37.2001 0.7624 4.9432 20.9324 18.0269 18.8914 6.4646 19.8728 89.6813
temp: 298.150 k
press: 1.00000 atm
elementType: 8 7 7 7 7 7 6 6 6 6 6 6 6 6 6 6 6 6 6 1 1 1 1 1 1 1 1 1 1 1 1 1 1 1
symmnumber: 1
zpe: 700241.8 jmol-1
zpe.correction: 0.266708 hartree
zpe.thermalcorrener: 0.284659 hartree
zpe.thermalcorrenthalpy: 0.285603 hartree
zpe.thermalcorrgfe: 0.217740 hartree
zpe.sumelectzpe: -851.940733 hartree
zpe.sumelectthermal: -851.922783 hartree
zpe.sumelectthermalent: -851.921839 hartree
zpe.sumelectthermalfe: -851.989702 hartree
dipole: 1.0057 -5.0672 -3.3538
dipole: 6.1592
quadrupole: -90.9155 -118.8899 -115.8798
quadrupole: -0.5087 11.3705 -2.3838
quadrupole: 17.6463 -10.3282 -7.3181 -0.5087 11.3705 -2.3838
hfenergy: -852.2074413 hartree
pointgroup: C01 [X(C13H15N5O1)]
dipole: -0.3921753 -1.9516661 1.3817486 debye
polarizability: 240.832002|21.2321853|214.8981953|9.729223|-12.4177962|102.8890921 unknown
InChI: InChI=1S/C13H15N5O/c1-9(2)12(19)16-18-13-15-11(8-14-17-13)10-6-4-3-5-7-10/h3-9,16,18H,1-2H3
charge 0 multiplicity 1
34 atoms
O  3.119872 0.213198 -1.265338
N  2.617223 0.573183 0.982188
N  1.986399 1.794464 0.753783
N  -0.127225 0.758305 0.439205
N  0.272004 3.140568 -0.058778
N  -1.022775 3.282903 -0.466117
C  3.62035 -1.593195 0.343112
C  2.67875 -2.672893 -0.253834
C  5.075427 -1.781393 -0.150376
C  3.105852 -0.208248 -0.078185
C  -2.322266 -0.264682 0.116204
C  -1.428201 0.916852 0.036678
C  0.660241 1.86719 0.351669
C  -3.732964 -0.146596 -0.021971
C  -1.759301 -1.551814 0.335869
C  -1.853698 2.193002 -0.437387
C  -4.556586 -1.288848 0.05322
C  -2.583212 -2.692057 0.407638
C  -3.986021 -2.565739 0.265666
H  3.600465 -1.673873 1.449678
H  3.031641 -3.68239 0.023717
H  2.667106 -2.593707 -1.354906
H  1.641484 -2.553973 0.109642
H  5.760975 -1.050906 0.315787
H  5.434357 -2.797769 0.09251
H  5.119668 -1.642069 -1.244476
H  2.513238 0.173393 1.917329
H  2.570756 2.60756 0.544133
H  -4.197357 0.834017 -0.170028
H  -0.672968 -1.627594 0.442051
H  -2.860049 2.383759 -0.813232
H  -5.641995 -1.183609 -0.049177
H  -2.136206 -3.678814 0.570609
H  -4.627784 -3.451928 0.32122
