program: Gaussian 09
title: 000051080
version: EM64L-G09RevD.01
frameworkgroup: C1[X(C10H9NS)]
method: RPBEPBE
basis: SDD
operation: Freq
keyword: #p
keyword: freq=noraman
keyword: PBEPBE/SDD
title: #p freq=noraman PBEPBE/SDD
converged: YES YES NO NO
title: Mulliken charges:
elementType: S N C C C C C C C C C C H H H H H H H H H
charge: 0.215221 -0.413011 0.343791 0.239791 -0.321064 -0.282650 -0.396615 -0.339425 -0.245564 -0.212675 -0.304554 -0.504726 0.310629 0.277975 0.252755 0.228599 0.223353 0.223272 0.258301 0.219995 0.226603
chargesum: 0.00000
title: Mulliken charges with hydrogens summed into heavy atoms:
elementType: S N C C C C C C C C C C
charge: 0.215221 -0.102382 0.343791 0.239791 -0.321064 -0.004675 -0.143860 -0.110827 -0.022211 0.010598 -0.046252 -0.058129
polarizability: 1.82829734e+02 6.60115703e+00 1.38494507e+02 2.95854769e+00 9.09721424e-01 7.08980661e+01
1716.lowfreq: -11.0195 -2.7610 -0.0023 0.0007 0.0014 2.8313 23.8180 72.9969 75.4371
frequency: 23.8080 72.9837 75.4314 155.4023 189.6571 218.1108 314.2451 339.5863 423.1774 445.1042 464.8654 529.6731 550.2516 568.9983 577.2231 611.6980 636.9079 650.5124 752.3896 755.5226 766.0967 807.4935 857.9759 864.1653 889.2215 938.5243 952.8099 977.9022 982.5606 1009.6105 1022.7638 1090.9964 1126.6814 1165.4689 1200.4463 1243.1069 1252.3074 1279.4718 1323.5259 1369.6172 1389.6670 1416.6067 1453.9160 1481.9069 1513.5350 1586.0130 1601.3292 1630.0299 3098.9128 3126.9040 3136.8730 3149.2359 3150.7694 3165.9437 3208.1970 3237.4770 3607.4469
redmass: 4.7473 2.9673 2.1840 6.7180 5.2423 4.0451 3.8040 6.6758 2.8902 4.8108 5.8502 1.2738 6.2857 1.5438 2.8536 3.3234 7.1879 3.6957 1.3591 5.2549 3.6442 1.4034 1.4740 5.0032 1.3815 1.3724 1.0704 1.3044 5.7539 2.1159 1.4262 1.6541 1.4591 1.0873 2.3200 1.6612 1.2136 2.5236 2.1990 3.0895 1.2038 2.7208 4.1606 2.8972 4.8178 6.2553 4.2196 7.1652 1.0586 1.0853 1.0892 1.0978 1.0953 1.1002 1.1146 1.0993 1.0810
irintensity: 0.6511 1.4449 0.4173 0.7665 0.2245 9.4998 0.3722 1.6974 12.5734 1.0890 9.4871 97.1793 3.5904 13.8866 11.3990 1.3060 3.7527 16.7272 108.3275 7.7480 12.6177 16.5178 0.9689 0.6559 60.0472 4.1401 51.5868 0.0430 20.7558 12.0946 27.9201 29.7011 8.8652 1.4696 15.5578 20.0388 2.7926 1.4085 9.2259 36.7835 6.5947 7.6326 17.0918 2.5540 2.1188 5.5013 82.8614 2.7893 1.8106 0.4383 9.3555 3.6464 27.2202 25.0812 12.2055 0.2847 67.3168
temp: 298.150 k
press: 1.00000 atm
elementType: 16 7 6 6 6 6 6 6 6 6 6 6 1 1 1 1 1 1 1 1 1
symmnumber: 1
zpe: 421271.3 jmol-1
zpe.correction: 0.160454 hartree
zpe.thermalcorrener: 0.171200 hartree
zpe.thermalcorrenthalpy: 0.172145 hartree
zpe.thermalcorrgfe: 0.122484 hartree
zpe.sumelectzpe: -838.411927 hartree
zpe.sumelectthermal: -838.401180 hartree
zpe.sumelectthermalent: -838.400236 hartree
zpe.sumelectthermalfe: -838.449896 hartree
dipole: 2.1239 1.9206 1.5812
dipole: 3.2711
quadrupole: -71.5301 -64.9379 -81.0476
quadrupole: 6.6048 0.7706 2.4814
quadrupole: 0.9751 7.5673 -8.5424 6.6048 0.7706 2.4814
hfenergy: -838.5723804 hartree
pointgroup: C01 [X(C10H9N1S1)]
dipole: -0.7685385 -0.8460022 0.5914715 debye
dipolederiv: -0.0116445 -0.015309 -0.1103678 -0.1884386 -0.1859352 -0.0699755 -0.4224666 -0.1995971 -0.095316 -0.7085811 -0.3472535 0.037479 0.0486735 -0.522189 0.0049279 0.0815014 0.104303 -0.2803067 0.0479238 -0.2745891 0.041944 -0.1977251 -0.1338321 0.0215577 0.0852498 0.1081646 0.0131405 -0.160246 -0.0318661 0.0297611 -0.3207333 0.4294849 0.0040579 0.0794108 -0.0271429 0.022313 0.3623371 0.1032291 -0.0765667 -0.0006624 -0.1219712 -0.0354442 -0.0565898 -0.0329251 -0.2421254 0.3197493 0.4183638 -0.1136364 0.4351357 0.1023408 -0.0648049 -0.1455905 -0.1282593 -0.0877635 0.0564652 0.0231598 -0.0598127 -0.0383198 0.077348 -0.013559 -0.0516231 -0.0347071 -0.1327314 0.0803318 0.029218 -0.0659473 -0.0340685 -0.0165534 -0.0136094 -0.0602388 -0.0299454 -0.1656868 -0.1523283 0.0281781 -0.0116236 -0.0076691 0.102542 -0.0272814 -0.0082203 -0.0398478 -0.1717312 0.0502082 -0.0043365 -0.0636719 0.0933585 -0.0505718 -0.0313714 -0.0636101 -0.0130385 -0.1605256 0.1805023 0.2945952 0.2791895 0.4962106 0.145693 0.284961 0.5368503 0.3415858 0.3234658 -0.4776289 -0.0337515 -0.2217722 -0.0994344 -0.4396511 -0.0329632 -0.310532 -0.0427061 -0.0267317 0.1399901 -0.0012076 0.0439197 0.0372471 0.2330406 0.0120885 0.0349571 0.004337 0.3348682 0.0874233 0.0545965 0.0260753 0.0569991 0.0342232 0.0109656 0.0269055 0.0122492 0.1914001 0.0209502 -0.0898115 0.0469187 -0.0673021 0.0282252 0.0214726 0.040552 0.0325595 0.1343682 -0.0319168 -0.0740834 0.0535172 -0.1102709 -0.0076862 0.0457579 0.060237 0.0383451 0.1573052 0.0672101 0.046629 0.0139269 0.0636429 -0.1248814 0.0237456 0.014133 0.0221986 0.1565347 -0.1077738 0.0719547 0.0531067 0.0814307 0.0615723 -0.0068304 0.0568919 -0.006471 0.1506495 0.0886483 -0.0542056 0.0672178 -0.0931646 0.0988819 -0.0351595 0.024884 -0.0441038 -0.0588184 0.0599832 -0.0870463 -0.0484615 -0.1116546 0.1256901 -0.0844536 -0.0377574 -0.0755634 -0.0339775 0.0883966 -0.0564641 0.078804 -0.0432547 0.1642294 -0.0140822 0.1150558 0.0105646 -0.0283309 unknown
polarizability: 181.5857471|9.3101254|139.0581998|-7.1244391|3.9615244|71.5783601 unknown
InChI: InChI=1S/C10H9NS/c1-2-12-10-7-11-9-6-4-3-5-8(9)10/h2-7,11H,1H2
charge 0 multiplicity 1
21 atoms
S  2.466171 -0.265792 -0.942204
N  -0.90346 -2.182804 0.158722
C  -0.35759 0.010501 -0.209973
C  -1.43012 -0.881555 0.147018
C  0.823738 -0.811532 -0.395505
C  0.456895 -2.13773 -0.166007
C  -0.61479 1.402278 -0.308057
C  -2.738223 -0.419247 0.411403
C  -1.91752 1.867766 -0.047064
C  -2.966468 0.96807 0.310167
C  3.070877 0.551453 0.587086
C  4.209528 1.283398 0.641725
H  -1.429873 -3.028714 0.366529
H  1.067063 -3.036766 -0.213571
H  0.189571 2.09174 -0.585939
H  -3.548549 -1.104655 0.684183
H  -2.136908 2.938729 -0.118863
H  -3.968885 1.363814 0.50783
H  2.429497 0.377422 1.458417
H  4.532773 1.725501 1.590194
H  4.843871 1.459023 -0.23399
