program: Gaussian 09
title: 000051131
version: EM64L-G09RevD.01
frameworkgroup: C1[X(C13H13Cl2N5O)]
method: RPBEPBE
basis: SDD
operation: Freq
keyword: #p
keyword: freq=noraman
keyword: PBEPBE/SDD
title: #p freq=noraman PBEPBE/SDD
converged: YES YES NO NO
title: Mulliken charges:
elementType: Cl Cl O N N N N N C C C C C C C C C C C C C H H H H H H H H H H H H H
charge: -0.111574 -0.037937 -0.228408 -0.349473 -0.308888 -0.103897 -0.099360 -0.033846 -0.505278 -0.366781 0.220913 -0.583193 0.354426 0.171383 0.043570 -0.354426 -0.325713 -0.218358 -0.227023 -0.390474 -0.109404 0.232492 0.251826 0.241031 0.242317 0.324640 0.277123 0.336791 0.352609 0.241151 0.278045 0.261601 0.269221 0.254894
chargesum: 0.00000
title: Mulliken charges with hydrogens summed into heavy atoms:
elementType: Cl Cl O N N N N N C C C C C C C C C C C C C
charge: -0.111574 -0.037937 -0.228408 -0.012682 0.043722 -0.103897 -0.099360 -0.033846 -0.020959 0.116567 0.220913 0.018569 0.354426 0.171383 0.043570 -0.113274 -0.047668 0.043243 0.042198 -0.135580 -0.109404
polarizability: 2.84387243e+02 -3.02287459e+01 2.15662465e+02 1.17470761e+01 1.09271157e+01 1.25267483e+02
1716.lowfreq: -6.0941 -3.8423 -3.5598 0.0018 0.0021 0.0025 20.5270 23.0447 36.6928
frequency: 20.2592 22.8856 36.6817 44.4840 62.3789 65.7535 77.6421 86.6901 130.0492 150.5440 162.9420 169.9104 221.1301 253.7096 273.4116 292.3907 301.4879 311.5674 338.4497 409.2245 421.4353 431.9178 446.5057 460.8927 482.7668 497.4082 516.0580 571.9737 583.0791 615.6196 624.8141 652.3790 658.7447 678.8583 720.3245 728.0509 738.8922 776.9283 794.4070 828.7784 848.7269 867.1696 869.9153 901.6347 920.0771 958.3747 959.6691 972.6603 993.0396 1000.2815 1009.9844 1057.3564 1072.8622 1083.5208 1091.3961 1112.8146 1117.2407 1121.8310 1147.7244 1188.3154 1193.7578 1237.9096 1269.9281 1292.1774 1295.7090 1301.3959 1306.5854 1320.0443 1357.6053 1358.9528 1394.7533 1434.0270 1443.1110 1445.5748 1459.2920 1465.8177 1472.4983 1475.9574 1496.1098 1519.4904 1576.1168 1599.2676 1640.5754 2986.8075 3018.1870 3043.2900 3060.6107 3088.0786 3137.1460 3147.7057 3155.3409 3173.5694 3176.6638 3183.8354 3501.4341 3539.3365
redmass: 7.4160 10.9664 7.1119 6.8807 9.4346 4.9015 9.4545 5.5154 5.7991 5.7513 5.3686 5.8183 5.4235 10.2519 4.6277 5.5296 3.2599 3.8798 4.0226 2.9378 4.3081 3.4575 4.7272 8.1344 3.2219 1.9522 2.3552 1.8788 3.3226 3.5317 5.3450 5.7195 5.8142 5.2050 3.9885 3.6915 5.6365 3.9929 1.6870 1.3755 1.3332 3.0922 1.6576 6.8875 3.6784 4.0780 1.5830 1.9546 1.6265 2.5468 1.7476 4.8674 3.0949 2.2386 2.5747 4.1594 1.5614 2.2744 1.1104 1.1788 2.0236 1.7656 1.9153 1.8648 1.3114 1.3772 1.8497 1.3728 1.4134 4.3155 5.2623 3.4719 2.0903 1.1739 1.3227 1.2527 1.3508 1.9922 3.4850 3.6950 7.5861 6.1519 7.1520 1.0626 1.0612 1.0639 1.0933 1.1026 1.1110 1.0891 1.0895 1.0960 1.0972 1.0925 1.0804 1.0772
irintensity: 0.0464 2.8868 0.9193 3.7631 4.5852 1.4708 2.5429 4.1992 2.3386 9.5193 2.4531 3.9331 0.9657 1.6462 0.4492 8.1876 7.2037 3.3747 0.1841 0.9214 3.4868 2.5960 5.2634 22.6241 12.2047 18.2371 32.8142 138.7566 24.3264 59.9228 11.5168 1.1280 5.6617 10.8908 6.6011 2.3887 26.3235 8.5107 10.1435 26.2986 61.9391 5.6974 3.8315 2.2083 14.7462 12.8816 5.3741 21.3789 21.2532 26.5897 6.5497 57.5580 81.9208 25.4819 2.8622 28.3049 9.3638 53.4771 1.2892 4.9528 11.6599 46.2724 55.4490 17.1694 5.4228 24.6070 18.9302 15.6697 2.0310 10.1740 5.2581 59.1969 28.5729 14.8769 102.8380 51.8767 74.4749 261.4815 234.3385 245.3327 4.7859 81.9716 164.5487 13.5677 14.2454 14.5823 18.2479 9.8862 4.9466 4.3371 1.9596 1.9951 1.7968 4.7552 27.8208 106.1599
temp: 298.150 k
press: 1.00000 atm
elementType: 17 17 8 7 7 7 7 7 6 6 6 6 6 6 6 6 6 6 6 6 6 1 1 1 1 1 1 1 1 1 1 1 1 1
symmnumber: 1
zpe: 655103.1 jmol-1
zpe.correction: 0.249516 hartree
zpe.thermalcorrener: 0.269210 hartree
zpe.thermalcorrenthalpy: 0.270155 hartree
zpe.thermalcorrgfe: 0.197762 hartree
zpe.sumelectzpe: -1770.725240 hartree
zpe.sumelectthermal: -1770.705545 hartree
zpe.sumelectthermalent: -1770.704601 hartree
zpe.sumelectthermalfe: -1770.776994 hartree
dipole: 1.1746 -3.3032 -0.4944
dipole: 3.5405
quadrupole: -137.8781 -146.0466 -139.1151
quadrupole: 20.6199 11.4961 -3.3467
quadrupole: 3.1352 -5.0333 1.8981 20.6199 11.4961 -3.3467
hfenergy: -1770.9747559 hartree
pointgroup: C01 [X(C13H13Cl2N5O1)]
dipole: 0.2487352 -1.3256678 -0.3479081 debye
polarizability: 269.7084836|-43.1486395|224.6246402|18.3506348|18.2738578|130.9840672 unknown
InChI: InChI=1S/C13H13Cl2N5O/c14-7-1-2-12(21)18-20-13-17-11(8-16-19-13)9-3-5-10(15)6-4-9/h3-6,8,18,20H,1-2,7H2
charge 0 multiplicity 1
34 atoms
Cl -1.362072 -2.759763 -1.84568
Cl 5.296914 -2.724744 0.14354
O  -3.941622 0.164623 1.279197
N  -3.125205 0.268799 -0.904716
N  -2.70516 1.592835 -0.782743
N  -0.459125 0.971422 -0.31378
N  -1.281835 3.287207 -0.073481
N  -0.032156 3.709045 0.270852
C  -3.989589 -1.884048 -0.090142
C  -2.903645 -2.794296 0.543663
C  -3.699393 -0.408343 0.18212
C  -1.483534 -2.520173 0.052752
C  1.887871 0.417039 0.082109
C  0.791472 1.412529 0.037258
C  -1.429741 1.931157 -0.364379
C  3.069658 0.647309 0.838739
C  1.767452 -0.794731 -0.652223
C  4.108109 -0.305722 0.864326
C  2.800116 -1.752639 -0.641668
C  0.989366 2.795373 0.318768
C  3.95822 -1.493266 0.119622
H  -4.056451 -2.090741 -1.173223
H  -4.966473 -2.119449 0.365605
H  -3.170648 -3.851721 0.364992
H  -2.899853 -2.636085 1.641783
H  -1.152811 -1.480539 0.203903
H  -0.751636 -3.231682 0.461697
H  -2.813717 -0.24343 -1.735637
H  -3.422851 2.31622 -0.691349
H  3.179126 1.557987 1.436583
H  0.86501 -0.971818 -1.245505
H  5.011793 -0.132757 1.455227
H  2.708873 -2.676772 -1.219107
H  1.965437 3.216573 0.565597
