program: Orca
programVersion: 5.0.3
elementType: C H C H C C C H H C H H C C H H H H H H H
charge: 1
multiplicity: 1
keywords: b3lyp def2-TZVP EnGrad D3BJ RIJCOSX verytightscf def2/J soscf
formula: C8H13
InChI: InChI=1/C8H13/c1-2-4-6-8-7-5-3-1/h1-2,7H,3-6,8H2
21 atoms
C  -1.997358 0.748845 0.074373
H  -2.179187 0.853911 1.147174
C  -1.740002 -0.948079 -0.150024
H  -2.618464 -1.325742 0.378413
C  -0.424029 -1.376292 0.399808
C  0.691601 -1.282706 -0.36915
C  2.005276 -0.687879 0.06563
H  2.216939 -0.878799 1.123463
H  2.857968 -1.028875 -0.52666
C  1.795328 0.880626 -0.144948
H  1.84921 1.128873 -1.210273
H  2.603303 1.419832 0.355117
C  0.422018 1.252866 0.466634
C  -0.761884 1.314125 -0.379276
H  0.527988 -1.212844 -1.449184
H  -1.841348 -1.122382 -1.222042
H  0.143413 0.388326 1.084093
H  -0.643736 1.472236 -1.454969
H  -2.87569 0.984298 -0.52623
H  0.413227 2.015991 1.266559
H  -0.344156 -1.505767 1.480115
totalener: -312.19700897 hartree
nucrepener: 380.22252845 hartree
electener: -692.41953742 hartree
oneelecener: -1161.44154906 hartree
twoeener: 469.02201164 hartree
kineticenergy: 310.52831048 hartree
exchangeener: -36.316851578347 hartree
correlationener: -2.304768919758 hartree
xcener: -38.621620498105 hartree
chargesum: 1.0000000
charge: -0.219805 0.181542 -0.225627 0.185079 -0.147286 -0.067844 -0.207960 0.149083 0.157133 -0.269584 0.151276 0.160293 -0.092017 0.066459 0.131100 0.176166 0.118499 0.190411 0.183787 0.211770 0.167526
charge: -0.164720 0.166778 -0.133433 0.164638 -0.189038 -0.100466 -0.212721 0.150718 0.150388 -0.200629 0.145330 0.153895 -0.210535 0.087110 0.153211 0.155162 0.205448 0.168748 0.161858 0.195789 0.152470
qa: -0.2198 0.1815 -0.2256 0.1851 -0.1473 -0.0678 -0.2080 0.1491 0.1571 -0.2696 0.1513 0.1603 -0.0920 0.0665 0.1311 0.1762 0.1185 0.1904 0.1838 0.2118 0.1675
va: 3.8409 0.9621 3.8568 0.9567 3.7762 3.8317 3.8437 0.9689 0.9726 3.9037 0.9657 0.9698 3.6744 3.6380 0.9678 0.9602 1.0349 0.9542 0.9646 0.9473 0.9630
dispcorr: -0.036986150 hartree
energy: -312.233995123819
dipole: 0.10252 -0.87158 -0.76906 1.11381 -0.20451 0.90930 0.41744 -0.47993 -0.06249
magnitude: 1.19256 au
magnitude: 3.03124 debye
