program: Gaussian 09
title: 000051094
version: EM64L-G09RevD.01
frameworkgroup: C1[X(C12H13ClN6O)]
method: RPBEPBE
basis: SDD
operation: Freq
keyword: #p
keyword: freq=noraman
keyword: PBEPBE/SDD
title: #p freq=noraman PBEPBE/SDD
converged: YES YES NO NO
title: Mulliken charges:
elementType: Cl O N N N N N N C C C C C C C C C C C C H H H H H H H H H H H H H
charge: -0.056105 -0.236432 -0.377683 -0.313881 -0.550193 -0.094063 -0.097660 -0.036876 -0.230103 0.266025 0.353902 -0.669491 0.186174 -0.294002 -0.371454 0.040357 -0.102473 -0.214552 -0.381950 -0.232623 0.211152 0.245163 0.209206 0.235766 0.320908 0.287154 0.234536 0.348362 0.279214 0.289412 0.239528 0.249588 0.263094
chargesum: 0.00000
title: Mulliken charges with hydrogens summed into heavy atoms:
elementType: Cl O N N N N N N C C C C C C C C C C C C
charge: -0.056105 -0.236432 -0.056775 0.034481 0.018432 -0.094063 -0.097660 -0.036876 -0.018951 0.266025 0.353902 0.020644 0.186174 -0.006848 -0.136919 0.040357 -0.102473 0.024976 -0.132362 0.030472
polarizability: 2.44394907e+02 1.14299547e+01 2.35316755e+02 -1.30032008e+01 8.56563607e+00 1.02162642e+02
1716.lowfreq: -8.1086 -1.4163 0.0023 0.0026 0.0027 6.1951 14.9801 21.6250 34.3394
frequency: 14.7658 21.5539 34.3292 41.8501 46.3948 85.8686 86.7215 128.2408 178.9264 179.6151 209.8235 220.1679 244.1358 247.0383 262.5694 278.9018 311.2361 323.2722 332.0379 380.4522 415.2063 432.0547 444.7372 461.7005 481.9743 528.4290 542.6742 582.1205 615.9886 634.6949 657.9756 662.0079 674.9805 689.2115 696.2507 732.6145 758.3787 774.6005 799.4879 863.9454 878.1051 908.9233 914.7852 922.9282 926.7635 965.5554 981.3863 982.3343 986.4895 1046.0782 1060.6144 1073.8713 1091.3998 1094.9413 1103.3768 1121.8437 1131.5995 1183.8490 1230.4359 1232.9137 1262.8128 1294.4924 1302.5077 1310.3739 1358.0507 1377.1388 1384.0789 1401.7448 1428.3557 1447.9947 1456.4339 1462.0962 1470.7599 1476.5136 1492.6551 1515.4545 1572.0585 1606.8817 1639.1103 1643.0976 2990.4533 2992.7656 3088.4540 3108.4643 3144.8933 3162.4840 3176.1808 3179.0437 3185.0014 3441.8535 3521.9707 3533.3422 3570.6754
redmass: 6.9930 4.6679 4.0596 6.0979 5.4737 6.8273 7.9882 5.3698 4.9576 5.2440 2.3581 5.5659 2.4745 1.4471 1.9738 4.1975 3.1265 3.1046 6.6951 8.7770 4.7732 3.0773 3.4422 2.9422 1.8250 4.2230 4.6822 1.5741 7.8046 1.4898 4.2448 4.4767 4.4714 4.0137 2.1887 6.6313 6.9729 3.7342 1.5961 1.5970 3.5985 1.3773 5.6714 1.5933 2.7787 7.1612 1.4324 1.3604 4.4933 3.9920 1.9791 2.2200 2.1288 2.4674 2.9248 5.0174 2.5729 1.1009 3.2767 2.0053 1.7654 1.7530 1.5700 1.8657 1.2951 6.0037 1.2217 4.1596 2.4462 1.5393 2.9410 1.0454 2.1867 1.0581 4.7837 4.1712 6.7311 6.7162 2.4606 1.5318 1.0407 1.0793 1.0999 1.1009 1.0870 1.0934 1.0926 1.0976 1.0926 1.0449 1.0789 1.0773 1.0978
irintensity: 1.1504 0.5754 0.1367 5.3799 0.4908 0.5105 1.3215 6.6176 4.4053 0.5974 4.8896 1.3636 4.1469 14.0417 20.3173 7.2483 14.9057 20.7576 2.3056 4.1434 0.9815 13.9421 5.9055 6.9121 33.0995 6.4687 8.5510 176.7801 3.0924 193.0138 40.7870 16.6918 106.1176 8.5775 16.9976 23.3980 18.9509 14.4326 37.4157 23.5438 6.7626 1.2340 19.8439 10.1443 1.1839 17.2453 4.2316 0.2157 1.8278 87.1322 26.0881 21.1635 10.2170 13.1741 60.4306 52.6735 13.1705 3.8803 50.7872 1.4734 48.7113 4.5961 25.6687 2.5142 0.6812 1.1206 26.4181 3.6400 44.2867 127.6287 28.7857 13.3514 37.0565 9.1406 385.9276 285.1713 31.3616 0.7437 115.9709 37.0788 27.4046 28.3919 27.6088 17.0901 5.8221 6.5238 1.5933 7.8820 7.3372 3.3499 21.0511 84.5231 3.7990
temp: 298.150 k
press: 1.00000 atm
elementType: 17 8 7 7 7 7 7 7 6 6 6 6 6 6 6 6 6 6 6 6 1 1 1 1 1 1 1 1 1 1 1 1 1
symmnumber: 1
zpe: 645465.0 jmol-1
zpe.correction: 0.245845 hartree
zpe.thermalcorrener: 0.264964 hartree
zpe.thermalcorrenthalpy: 0.265908 hartree
zpe.thermalcorrgfe: 0.195099 hartree
zpe.sumelectzpe: -1327.366535 hartree
zpe.sumelectthermal: -1327.347416 hartree
zpe.sumelectthermalent: -1327.346472 hartree
zpe.sumelectthermalfe: -1327.417281 hartree
dipole: -2.2731 -1.2831 -2.8069
dipole: 3.8330
quadrupole: -99.0866 -145.8172 -125.1643
quadrupole: -9.3509 -12.3728 -1.9132
quadrupole: 24.2694 -22.4612 -1.8083 -9.3509 -12.3728 -1.9132
hfenergy: -1327.6123799 hartree
pointgroup: C01 [X(C12H13Cl1N6O1)]
dipole: 0.7646399 0.5568787 -1.1744467 debye
polarizability: 241.5644243|12.6120342|237.4054859|8.1578079|-16.293699|102.9043941 unknown
InChI: InChI=1S/C12H13ClN6O/c1-7(14)11(20)17-19-12-16-10(6-15-18-12)8-3-2-4-9(13)5-8/h2-7,17,19H,14H2,1H3
charge 0 multiplicity 1
33 atoms
Cl 1.950307 3.826774 -0.712571
O  -2.79524 0.087466 1.33987
N  -2.831069 -0.537926 -0.91005
N  -2.354376 -1.828741 -0.676743
N  -2.359096 2.826498 0.138058
N  -0.128784 -1.045798 -0.448207
N  -0.775049 -3.357805 0.101996
N  0.509254 -3.639754 0.465651
C  -3.337555 1.830643 -0.333865
C  -2.965846 0.396079 0.129855
C  2.150868 -0.243073 -0.166779
C  -4.742406 2.17946 0.20446
C  1.153444 -1.339203 -0.072096
C  1.673461 1.078661 -0.37605
C  3.548855 -0.466503 -0.049187
C  -1.033219 -2.055655 -0.322248
C  2.588874 2.135317 -0.455243
C  4.449321 0.616302 -0.13637
C  1.456351 -2.648908 0.398602
C  3.979428 1.935351 -0.338642
H  -3.355168 1.874097 -1.4411
H  -5.003762 3.205692 -0.101933
H  -5.507146 1.478615 -0.176336
H  -4.746427 2.123142 1.307892
H  -2.830061 -0.225218 -1.883842
H  0.595621 1.234145 -0.465793
H  3.941777 -1.477854 0.094058
H  -3.02685 -2.557027 -0.422732
H  -1.448479 2.802807 -0.333982
H  -2.261498 2.828922 1.160125
H  5.526267 0.439825 -0.050183
H  2.447977 -2.946573 0.743263
H  4.672927 2.778445 -0.403279
