program: Orca
programVersion: 5.0.3
elementType: C H C H C C C H H C H H C C H H H H H H H
charge: 1
multiplicity: 1
keywords: DSD-PBEP86/2013 def2-TZVP D3BJ RIJCOSX verytightscf def2-TZVP/C def2/J soscf noTRAH
formula: C8H13
InChI: InChI=1/C8H13/c1-2-4-6-8-7-5-3-1/h1-2,7H,3-6,8H2
21 atoms
C  -1.991619 0.590989 0.088068
H  -2.169156 0.765253 1.155524
C  -1.828338 -0.958676 -0.172799
H  -2.65079 -1.488194 0.316629
C  -0.441167 -1.30616 0.351028
C  0.650468 -1.237989 -0.439544
C  1.945431 -0.697082 0.072393
H  2.111469 -0.943655 1.126181
H  2.813346 -1.035306 -0.503783
C  1.82421 0.851541 -0.100849
H  1.867491 1.110725 -1.164976
H  2.658257 1.362185 0.388805
C  0.483966 1.419343 0.510301
C  -0.684413 1.166089 -0.321457
H  0.525492 -1.2655 -1.524017
H  -1.887479 -1.154435 -1.248318
H  0.335663 1.096117 1.543375
H  -0.587903 1.46199 -1.37108
H  -2.820119 0.996253 -0.502118
H  0.622373 2.520184 0.505548
H  -0.319099 -1.339679 1.434744
totalener: -311.14675355 hartree
nucrepener: 380.29593856 hartree
electener: -691.44269211 hartree
oneelecener: -1161.02194831 hartree
twoeener: 469.57925620 hartree
kineticenergy: 310.01792922 hartree
exchangeener: -14.123545653619 hartree
correlationener: -0.943558969326 hartree
xcener: -15.067104622946 hartree
chargesum: 1.0000000
charge: -0.205625 0.175635 -0.211581 0.176766 -0.164767 -0.142705 -0.213983 0.155757 0.165869 -0.248214 0.151642 0.173763 -0.163981 0.099089 0.160632 0.166487 0.161989 0.213400 0.182170 0.202863 0.164793
charge: -0.192974 0.163583 -0.190098 0.151316 -0.117582 -0.134796 -0.219804 0.150305 0.153643 -0.194176 0.144575 0.150562 -0.211430 0.197511 0.153689 0.152763 0.158776 0.175119 0.161109 0.195464 0.152445
qa: -0.2056 0.1756 -0.2116 0.1768 -0.1648 -0.1427 -0.2140 0.1558 0.1659 -0.2482 0.1516 0.1738 -0.1640 0.0991 0.1606 0.1665 0.1620 0.2134 0.1822 0.2029 0.1648
va: 3.8429 0.9663 3.8562 0.9682 3.8713 3.8486 3.8918 0.9722 0.9714 3.8778 0.9702 0.9630 3.8522 3.5050 0.9648 0.9714 0.9776 0.9386 0.9678 0.9556 0.9644
total: -311.797997366 hartree
dispcorr: -0.014193784 hartree
energy: -311.812191149882
dipole: 0.46804 -1.03580 -0.56776 1.95280 -0.71691 1.23589 0.14647 -0.32303 -0.17656
magnitude: 1.37147 au
magnitude: 3.48601 debye
