program: Orca
programVersion: 5.0.3
elementType: C H C H C C C H H C H H C C H H H H H H H
charge: 1
multiplicity: 1
keywords: DSD-PBEP86/2013 cc-pVTZ EnGrad RIJCOSX verytightscf cc-pVTZ/C def2/J soscf
formula: C8H13
InChI: InChI=1/C8H13/c1-2-4-6-8-7-5-3-1/h1-2,7H,3-6,8H2
21 atoms
C  -1.998339 0.75978 0.070474
H  -2.163256 0.83412 1.148088
C  -1.730615 -0.964666 -0.157114
H  -2.618364 -1.316722 0.372606
C  -0.417467 -1.386087 0.393727
C  0.686796 -1.277231 -0.3763
C  2.00195 -0.691041 0.063101
H  2.210618 -0.887294 1.120398
H  2.856141 -1.033635 -0.526784
C  1.78975 0.860914 -0.141242
H  1.833106 1.120234 -1.204673
H  2.593797 1.408585 0.357239
C  0.421775 1.258921 0.486987
C  -0.767682 1.302657 -0.375002
H  0.522481 -1.203581 -1.456049
H  -1.835038 -1.1258 -1.230465
H  0.183853 0.556153 1.29238
H  -0.658541 1.577396 -1.4278
H  -2.881971 0.990226 -0.523044
H  0.461553 2.225289 1.030304
H  -0.336615 -1.489372 1.475453
totalener: -311.12535869 hartree
nucrepener: 379.55822723 hartree
electener: -690.68358592 hartree
oneelecener: -1159.50906201 hartree
twoeener: 468.82547608 hartree
kineticenergy: 309.72514338 hartree
exchangeener: -12.750957604678 hartree
correlationener: -0.942998396727 hartree
xcener: -13.693956001405 hartree
chargesum: 1.0000000
charge: -0.268384 0.202075 -0.243845 0.202483 -0.152053 -0.126742 -0.240104 0.158315 0.175986 -0.262994 0.161476 0.179407 -0.250575 0.102587 0.166348 0.193347 0.156413 0.234031 0.205106 0.220543 0.186582
charge: 0.131776 0.014347 0.175965 0.008271 0.018877 0.069532 0.075019 -0.004467 -0.003185 0.104397 -0.012238 -0.001257 0.074946 0.310754 -0.016790 -0.000337 0.007385 0.018041 0.006863 0.042884 -0.020782
qa: -0.2684 0.2021 -0.2438 0.2025 -0.1521 -0.1267 -0.2401 0.1583 0.1760 -0.2630 0.1615 0.1794 -0.2506 0.1026 0.1663 0.1933 0.1564 0.2340 0.2051 0.2205 0.1866
va: 3.8882 0.9700 3.9107 0.9643 3.8249 3.8454 3.9087 0.9863 0.9765 3.8905 0.9836 0.9747 3.8946 3.5556 0.9826 0.9710 1.0049 0.9573 0.9711 0.9614 0.9811
energy: -311.828797171271
dipole: 0.15706 -1.07891 -0.92185 1.55031 -0.45360 1.09671 0.40052 -0.52148 -0.12097
magnitude: 1.43778 au
magnitude: 3.65454 debye
