program: Orca
programVersion: 5.0.3
elementType: C H C H C C C H H C H H C C H H H H H H H
charge: 1
multiplicity: 1
keywords: DSD-PBEP86/2013 cc-pVTZ EnGrad RIJCOSX verytightscf cc-pVTZ/C def2/J soscf
formula: C8H13
InChI: InChI=1/C8H13/c1-2-4-6-8-7-5-3-1/h1-2,7H,3-6,8H2
21 atoms
C  -1.993575 0.517628 0.081752
H  -2.19156 0.771242 1.126454
C  -1.999331 -1.020671 -0.130344
H  -2.68253 -1.586029 0.504054
C  -0.543853 -1.087089 0.28625
C  0.576355 -1.061847 -0.526112
C  1.900809 -0.628689 0.026065
H  2.013568 -0.987913 1.054619
H  2.723826 -1.0304 -0.570456
C  1.935416 0.938196 0.013153
H  2.133881 1.287533 -1.006274
H  2.752998 1.296329 0.644022
C  0.569886 1.471017 0.487039
C  -0.4948 0.709886 -0.258055
H  0.478851 -1.270649 -1.590526
H  -2.151511 -1.296726 -1.177335
H  0.441201 1.376876 1.570711
H  -0.376144 0.802088 -1.341069
H  -2.653109 1.098123 -0.568552
H  0.471702 2.536504 0.237398
H  -0.370664 -1.034794 1.361771
totalener: -311.18265831 hartree
nucrepener: 387.49965621 hartree
electener: -698.68231452 hartree
oneelecener: -1175.16822569 hartree
twoeener: 476.48591117 hartree
kineticenergy: 309.75607179 hartree
exchangeener: -12.764405401922 hartree
correlationener: -0.949896208915 hartree
xcener: -13.714301610837 hartree
chargesum: 1.0000000
charge: -0.214709 0.170826 -0.245835 0.186494 -0.038932 -0.043189 -0.255446 0.167258 0.183836 -0.252244 0.164571 0.181722 -0.240545 -0.097814 0.226469 0.171586 0.160581 0.194973 0.183989 0.192663 0.203746
charge: 0.109138 0.000164 0.109082 -0.000416 0.125181 0.181191 0.085830 0.002825 0.006639 0.096000 -0.006100 0.000015 0.066323 0.185419 0.006423 -0.000126 -0.003474 0.005111 -0.001906 0.016010 0.016671
qa: -0.2147 0.1708 -0.2458 0.1865 -0.0389 -0.0432 -0.2554 0.1673 0.1838 -0.2522 0.1646 0.1817 -0.2405 -0.0978 0.2265 0.1716 0.1606 0.1950 0.1840 0.1927 0.2037
va: 3.8667 0.9851 3.8893 0.9767 3.7818 3.7662 3.9225 0.9818 0.9762 3.8955 0.9801 0.9734 3.8932 3.7778 0.9589 0.9845 0.9844 0.9819 0.9743 0.9678 0.9766
energy: -311.886760103063
dipole: 0.55338 -0.70835 -0.15497 1.83671 -1.94519 -0.10847 0.22929 -0.39796 -0.16867
magnitude: 0.25344 au
magnitude: 0.64420 debye
