program: Gaussian 09
title: 000051078
version: EM64L-G09RevD.01
frameworkgroup: C1[X(C10H11NS)]
method: RPBEPBE
basis: SDD
operation: Freq
keyword: #p
keyword: freq=noraman
keyword: PBEPBE/SDD
title: #p freq=noraman PBEPBE/SDD
converged: YES YES NO NO
title: Mulliken charges:
elementType: S N C C C C C C C C C C H H H H H H H H H H H
charge: 0.005084 -0.178324 0.281872 0.388496 -0.372037 -0.232674 -0.434843 -0.342968 -0.413099 -0.658715 -0.231821 -0.242278 0.221165 0.224227 0.269867 0.231867 0.251055 0.238309 0.218191 0.231444 0.220707 0.221879 0.102595
chargesum: 0.00000
title: Mulliken charges with hydrogens summed into heavy atoms:
elementType: S N C C C C C C C C C C
charge: 0.107679 -0.178324 0.281872 0.388496 0.073355 0.037193 -0.434843 -0.111101 -0.162044 0.029229 -0.011114 -0.020399
polarizability: 1.56912332e+02 3.03462277e+00 1.58052581e+02 -2.79389444e+00 3.97437610e+00 6.98710305e+01
1716.lowfreq: -9.1217 -0.0023 -0.0015 -0.0010 5.8028 9.6988 48.3007 83.6060 131.8272
frequency: 48.1022 83.5873 131.8223 152.9257 162.2673 189.0255 224.5961 264.0893 276.8197 372.0417 419.8124 428.1639 518.0108 538.6601 572.2300 586.4867 608.2760 722.4545 750.4275 751.2746 763.1338 792.9795 805.8275 854.3533 888.5198 923.7939 934.9680 974.2796 975.4012 1010.4094 1055.1624 1087.3389 1108.1690 1134.3166 1165.6141 1169.7044 1226.2008 1267.9300 1322.6707 1338.4552 1350.8987 1364.3321 1390.0148 1409.3981 1457.7573 1466.5109 1470.1582 1478.8412 1489.8473 1514.4449 1580.1870 1623.1709 2362.2927 2989.4851 3001.8106 3057.8446 3088.7091 3099.1054 3124.5400 3133.9910 3147.2212 3163.1186 3224.7403
redmass: 2.5934 3.6980 4.2386 1.1752 5.1579 1.3093 3.8281 2.2823 2.5317 6.4304 4.4549 3.1190 3.7919 4.9053 4.9547 3.7278 3.4008 4.5829 1.3122 3.7663 3.5700 1.2862 1.3206 1.4556 1.2524 3.1341 1.3792 2.8807 1.4198 2.1143 2.7378 1.8902 1.9071 1.7332 1.4274 1.1456 1.7748 1.4534 2.3544 2.1976 1.7313 2.5363 1.2185 3.9859 2.7843 1.1651 1.9089 1.3378 1.1674 4.3739 6.8835 7.4586 1.0391 1.0355 1.0616 1.1020 1.0995 1.1019 1.0848 1.0889 1.0953 1.1002 1.0988
irintensity: 0.0312 2.0183 1.1080 20.6163 0.7766 0.7705 4.8485 1.5670 0.1964 0.5280 3.1971 9.2290 0.4492 5.5170 2.0865 0.6021 1.6057 1.1288 109.8189 8.7789 0.3684 3.0510 22.9647 2.0713 17.0346 7.2038 3.1147 9.2596 1.8139 13.4425 5.0281 5.1540 2.9171 24.5513 8.3992 8.8907 33.1799 1.5915 32.4690 48.5166 1.0659 23.8101 19.8784 18.5956 39.0385 9.3696 5.8266 3.3162 16.7753 20.4865 0.8721 3.7181 53.5640 23.1606 41.1430 5.3217 44.7589 29.3335 0.2111 7.6775 29.2453 28.3539 0.0934
temp: 298.150 k
press: 1.00000 atm
elementType: 16 7 6 6 6 6 6 6 6 6 6 6 1 1 1 1 1 1 1 1 1 1 1
symmnumber: 1
zpe: 476046.3 jmol-1
zpe.correction: 0.181316 hartree
zpe.thermalcorrener: 0.192658 hartree
zpe.thermalcorrenthalpy: 0.193602 hartree
zpe.thermalcorrgfe: 0.143613 hartree
zpe.sumelectzpe: -839.608165 hartree
zpe.sumelectthermal: -839.596823 hartree
zpe.sumelectthermalent: -839.595879 hartree
zpe.sumelectthermalfe: -839.645868 hartree
dipole: 3.1388 -1.0018 -1.3108
dipole: 3.5459
quadrupole: -71.1119 -72.4245 -82.2612
quadrupole: -5.7772 2.5424 2.4000
quadrupole: 4.1540 2.8414 -6.9954 -5.7772 2.5424 2.4000
hfenergy: -839.7894813 hartree
pointgroup: C01 [X(C10H11N1S1)]
dipole: 1.0301292 -0.7432008 0.5768248 debye
dipolederiv: -0.1414825 -0.0605148 -0.1488696 -0.1001592 -0.0226995 -0.0434112 -0.1019748 -0.1011573 0.2188153 -0.7635716 0.0838323 -0.0267061 0.4770023 -0.6857685 0.0288636 -0.160197 0.0241983 -0.199548 0.4982898 0.3016105 0.0272151 0.1104071 -0.214669 0.0080816 0.0656701 0.0652192 0.0288847 -0.1602333 0.155113 -0.0372823 0.3738953 0.0064495 0.0530233 -0.0721259 0.0581148 0.0384139 0.7334555 -0.2292338 -0.0043424 -0.3078735 0.2788583 0.0026964 0.0794638 -0.0105572 0.2902447 0.1067979 -0.3864822 0.0544101 -0.515928 0.3195157 -0.0650867 0.1069427 -0.1247489 -0.1033523 -0.2371582 0.0098249 0.0755583 -0.0919908 0.3543779 -0.0707693 -0.059278 0.1847811 -0.2602647 -0.0458609 0.0496467 0.0168084 -0.0416591 0.0798494 -0.0141217 0.0363067 -0.0163495 -0.1757871 0.0686886 0.033772 0.0359305 -0.0293055 0.0823928 -0.0392954 0.0507473 -0.0275871 -0.1573189 -0.0682083 0.0459794 0.0297665 0.0824078 0.0101681 -0.0397884 0.0464766 -0.0624776 -0.0713861 -0.0280975 -0.100382 0.0341983 -0.0215902 0.0741442 -0.0311899 0.0289201 -0.0369975 -0.1781652 0.0747557 0.0194022 0.0486086 -0.0061992 -0.1478321 -0.0028071 0.0494289 0.0034974 -0.1716564 -0.0638643 -0.0206104 -0.0564032 -0.0986077 -0.0208583 -0.113983 -0.0376586 -0.0595965 0.0287477 0.0180961 -0.0182558 0.0763727 0.082054 -0.0541561 0.1199983 0.0240387 0.074363 -0.036772 0.0174916 -0.0640327 -0.0287814 -0.045026 0.0832224 0.0044519 -0.0350879 0.0085232 0.179045 -0.0106028 0.1186366 -0.0398305 0.0912899 -0.0195761 0.0245325 -0.0394412 0.0318919 0.1528799 0.0153476 0.0620539 -0.0291806 0.1046493 0.0095638 0.0329757 -0.034916 0.0243156 0.1475184 0.0229658 -0.1156414 -0.0712352 -0.0895798 0.0162762 -0.070191 -0.0473766 -0.0386421 0.0356995 -0.1453403 0.1337867 -0.0265426 0.1558764 0.0297174 0.0142083 -0.0221348 0.0153333 0.0716296 0.1051216 -0.0129093 0.0324182 -0.0608826 -0.0374361 0.1172795 0.0380352 0.0666681 -0.0167444 0.0637049 -0.0674896 -0.0092872 -0.0728399 -0.1227758 0.015933 -0.0108657 0.0146436 0.1592149 -0.1297216 -0.0648805 -0.0457028 -0.0591077 0.0636578 -0.0017804 -0.0477788 -0.0048734 0.1558024 0.0694262 0.1267744 0.0928773 0.0631669 -0.0824217 0.0703801 0.1428052 -0.0885624 -0.1359009 unknown
polarizability: 154.4173961|1.7709141|160.0531093|7.2384054|-3.5772754|70.3654376 unknown
InChI: InChI=1S/C10H11NS/c1-2-11-7-10(12)8-5-3-4-6-9(8)11/h3-7,12H,2H2,1H3
charge 0 multiplicity 1
23 atoms
S  -0.76585 3.448179 -0.449311
N  1.315965 0.059722 0.30143
C  0.048516 -0.525721 0.129733
C  -0.894565 0.531575 -0.135192
C  2.576808 -0.672235 0.507873
C  1.188647 1.446343 0.147966
C  -0.1433 1.770046 -0.11259
C  -0.34467 -1.88213 0.189627
C  -2.259945 0.210008 -0.345987
C  3.16723 -1.241124 -0.800863
C  -1.707968 -2.174056 -0.01883
C  -2.654907 -1.140057 -0.285913
H  3.296603 0.018823 0.981902
H  2.390901 -1.489106 1.230412
H  2.049467 2.106692 0.237144
H  0.373716 -2.684931 0.388798
H  -2.984281 1.003914 -0.55897
H  2.458826 -1.934542 -1.286454
H  4.102324 -1.791647 -0.589935
H  3.39456 -0.429816 -1.514338
H  -2.047127 -3.215355 0.020812
H  -3.704622 -1.408338 -0.4496
H  -1.360928 3.677457 0.788088
