program: Orca
programVersion: 5.0.3
elementType: C H C H C C C H H C H H C C H H H H H H H
charge: 1
multiplicity: 1
keywords: DSD-PBEP86 cc-pVTZ EnGrad RIJCOSX verytightscf cc-pVTZ/C def2/J soscf
formula: C8H13
InChI: InChI=1/C8H13/c1-2-4-6-8-7-5-3-1/h1-2,7H,3-6,8H2
21 atoms
C  -1.993003 0.545699 0.115152
H  -2.168523 0.732446 1.178585
C  -1.909109 -0.983232 -0.174414
H  -2.670269 -1.558202 0.357624
C  -0.489338 -1.211074 0.304973
C  0.6238 -1.171245 -0.484271
C  1.915378 -0.669621 0.070581
H  2.03591 -0.949963 1.122388
H  2.780686 -1.040673 -0.486593
C  1.863805 0.889914 -0.059588
H  1.949831 1.166496 -1.117255
H  2.715393 1.340605 0.457539
C  0.535694 1.47469 0.503349
C  -0.596552 0.960252 -0.290319
H  0.533351 -1.30881 -1.561703
H  -2.00011 -1.181728 -1.246916
H  0.406888 1.290395 1.574126
H  -0.461574 1.053248 -1.371374
H  -2.760456 1.059646 -0.474684
H  0.578394 2.569593 0.35817
H  -0.346186 -1.174433 1.386565
totalener: -311.16759019 hartree
nucrepener: 383.17464239 hartree
electener: -694.34223258 hartree
oneelecener: -1166.64643656 hartree
twoeener: 472.30420398 hartree
kineticenergy: 309.72596566 hartree
exchangeener: -12.756419573317 hartree
correlationener: -0.945797392586 hartree
xcener: -13.702216965903 hartree
chargesum: 1.0000000
charge: -0.229443 0.173833 -0.231318 0.184664 -0.089745 -0.113102 -0.249213 0.165833 0.183405 -0.250839 0.159265 0.184129 -0.237297 -0.015595 0.220100 0.167934 0.171546 0.217192 0.186025 0.205958 0.196666
charge: 0.087920 0.002201 0.092168 -0.000099 0.122910 0.121898 0.075042 0.000333 0.006457 0.099661 -0.006077 0.000028 0.064378 0.289498 -0.005067 0.000641 0.001782 0.007083 0.006043 0.032811 0.000390
qa: -0.2294 0.1738 -0.2313 0.1847 -0.0897 -0.1131 -0.2492 0.1658 0.1834 -0.2508 0.1593 0.1841 -0.2373 -0.0156 0.2201 0.1679 0.1715 0.2172 0.1860 0.2060 0.1967
va: 3.8663 0.9829 3.8898 0.9753 3.8185 3.8226 3.9192 0.9841 0.9760 3.8893 0.9816 0.9714 3.9068 3.6681 0.9632 0.9860 0.9823 0.9658 0.9745 0.9653 0.9775
energy: -311.870054988017
dipole: 0.55602 -0.82628 -0.27026 1.87088 -1.44061 0.43027 0.16520 -0.30043 -0.13524
magnitude: 0.52579 au
magnitude: 1.33646 debye
