program: Orca
programVersion: 5.0.3
elementType: C H C H C C C H H C H H C C H H H H H H H
charge: 1
multiplicity: 1
keywords: DSD-PBEP86/2013 cc-pVTZ EnGrad D3BJ RIJCOSX verytightscf cc-pVTZ/C def2/J soscf
formula: C8H13
InChI: InChI=1/C8H13/c1-2-4-6-8-7-5-3-1/h1-2,7H,3-6,8H2
21 atoms
C  -1.998208 0.640503 0.077504
H  -2.175889 0.786747 1.149176
C  -1.786587 -0.952333 -0.171731
H  -2.637684 -1.437839 0.31488
C  -0.419777 -1.34399 0.368621
C  0.664809 -1.25847 -0.417734
C  1.967172 -0.706117 0.07008
H  2.152652 -0.939316 1.123621
H  2.832717 -1.034488 -0.515241
C  1.808628 0.836966 -0.11494
H  1.844176 1.095619 -1.179151
H  2.626947 1.371834 0.374888
C  0.455602 1.376048 0.503808
C  -0.725523 1.232788 -0.330139
H  0.519456 -1.220891 -1.500852
H  -1.848511 -1.142651 -1.247249
H  0.292002 0.993749 1.513419
H  -0.636363 1.58778 -1.361936
H  -2.84765 0.988568 -0.515952
H  0.600483 2.476781 0.569029
H  -0.313204 -1.408286 1.451876
totalener: -311.13681034 hartree
nucrepener: 379.53203776 hartree
electener: -690.66884810 hartree
oneelecener: -1159.48433101 hartree
twoeener: 468.81548291 hartree
kineticenergy: 309.72162422 hartree
exchangeener: -14.118923006074 hartree
correlationener: -0.942681906184 hartree
xcener: -15.061604912258 hartree
chargesum: 1.0000000
charge: -0.234472 0.187973 -0.238915 0.184941 -0.158062 -0.155434 -0.231866 0.161380 0.176612 -0.245416 0.157702 0.180191 -0.233978 0.092991 0.176512 0.173309 0.171927 0.241195 0.192272 0.213253 0.187885
charge: 0.107009 0.013828 0.117193 0.001440 0.055402 0.045994 0.070257 -0.002959 0.002512 0.114662 -0.009228 -0.000780 0.080639 0.357236 -0.018524 -0.001397 0.006134 0.023000 0.009377 0.049187 -0.020980
qa: -0.2345 0.1880 -0.2389 0.1849 -0.1581 -0.1554 -0.2319 0.1614 0.1766 -0.2454 0.1577 0.1802 -0.2340 0.0930 0.1765 0.1733 0.1719 0.2412 0.1923 0.2133 0.1879
va: 3.8607 0.9762 3.9127 0.9720 3.8265 3.8454 3.9005 0.9863 0.9772 3.8800 0.9833 0.9728 3.9144 3.5044 0.9796 0.9803 0.9880 0.9510 0.9760 0.9654 0.9802
dispcorr: -0.014137519 hartree
energy: -311.821287738340
dipole: 0.38323 -1.01571 -0.63248 1.98252 -0.65006 1.33245 0.16522 -0.30398 -0.13876
magnitude: 1.48146 au
magnitude: 3.76556 debye
