program: Orca
programVersion: 5.0.3
elementType: C H C H C C C H H C H H C C H H H H H H H
charge: 1
multiplicity: 1
keywords: DSD-PBEP86 def2-TZVP RIJCOSX verytightscf def2-TZVP/C def2/J soscf noTRAH
formula: C8H13
InChI: InChI=1/C8H13/c1-2-4-6-8-7-5-3-1/h1-2,7H,3-6,8H2
21 atoms
C  -1.992638 0.518461 0.066236
H  -2.198588 0.793208 1.103964
C  -2.000169 -1.023444 -0.115935
H  -2.679187 -1.575199 0.534617
C  -0.542497 -1.0842 0.292665
C  0.570328 -1.057653 -0.530092
C  1.901363 -0.628065 0.011731
H  2.027185 -1.005446 1.032218
H  2.71703 -1.019818 -0.601062
C  1.936942 0.939041 0.025869
H  2.147062 1.304719 -0.985322
H  2.748016 1.285744 0.671259
C  0.567452 1.467847 0.492711
C  -0.490204 0.7071 -0.263952
H  0.463696 -1.27398 -1.592038
H  -2.159971 -1.32106 -1.155763
H  0.430154 1.368112 1.574808
H  -0.362627 0.803085 -1.345603
H  -2.646734 1.086252 -0.600313
H  0.469498 2.534359 0.248028
H  -0.360979 -1.025853 1.366424
totalener: -311.18667172 hartree
nucrepener: 387.55730452 hartree
electener: -698.74397624 hartree
oneelecener: -1175.32105673 hartree
twoeener: 476.57708049 hartree
kineticenergy: 310.03361205 hartree
exchangeener: -12.767730075814 hartree
correlationener: -0.950276457595 hartree
xcener: -13.718006533409 hartree
chargesum: 1.0000000
charge: -0.198998 0.164778 -0.194508 0.178119 -0.055490 -0.040598 -0.226779 0.161085 0.176596 -0.239909 0.153177 0.170929 -0.219353 -0.048966 0.212636 0.160272 0.145683 0.169596 0.173294 0.173504 0.184930
charge: -0.179321 0.152663 -0.176917 0.149469 -0.052242 0.002022 -0.199950 0.156161 0.156755 -0.207555 0.145988 0.149997 -0.222116 -0.009838 0.168037 0.151769 0.148938 0.175594 0.147770 0.165694 0.177081
qa: -0.1990 0.1648 -0.1945 0.1781 -0.0555 -0.0406 -0.2268 0.1611 0.1766 -0.2399 0.1532 0.1709 -0.2194 -0.0490 0.2126 0.1603 0.1457 0.1696 0.1733 0.1735 0.1849
va: 3.8756 0.9740 3.8809 0.9727 3.8402 3.7619 3.9045 0.9660 0.9685 3.8903 0.9709 0.9698 3.9232 3.7531 0.9392 0.9736 0.9725 0.9628 0.9710 0.9679 0.9566
total: -311.871348832 hartree
energy: -311.871348831674
dipole: 0.55716 -0.71912 -0.16196 1.82918 -1.97373 -0.14456 0.23526 -0.43095 -0.19569
magnitude: 0.29227 au
magnitude: 0.74289 debye
