program: Gaussian 09
title: 000051096
version: EM64L-G09RevD.01
frameworkgroup: C1[X(C11H9Cl2N5O)]
method: RPBEPBE
basis: SDD
operation: Freq
keyword: #p
keyword: freq=noraman
keyword: PBEPBE/SDD
title: #p freq=noraman PBEPBE/SDD
converged: YES YES NO NO
title: Mulliken charges:
elementType: Cl Cl O N N N N N C C C C C C C C C C C H H H H H H H H H
charge: 0.074868 0.052396 -0.171187 -0.088193 -0.315553 -0.350794 -0.098630 -0.036597 0.336075 0.177577 -0.356010 -0.351948 0.035397 -0.233949 -0.227306 -0.381201 -0.227439 0.391303 -0.698938 0.227867 0.278438 0.233559 0.235083 0.252039 0.235747 0.354691 0.331801 0.320906
chargesum: 0.00000
title: Mulliken charges with hydrogens summed into heavy atoms:
elementType: Cl Cl O N N N N N C C C C C C C C C C C
charge: 0.074868 0.052396 -0.171187 -0.088193 0.039138 -0.018993 -0.098630 -0.036597 0.336075 0.177577 -0.128142 -0.073510 0.035397 -0.000391 0.007777 -0.129162 0.008308 0.391303 -0.378033
polarizability: 2.34909049e+02 -2.87925940e+01 2.19584378e+02 -9.24676869e+00 -4.88580510e+00 9.18667143e+01
1716.lowfreq: -4.5920 -4.1111 -0.0023 -0.0017 -0.0016 4.0121 14.5332 22.3505 28.8419
frequency: 14.5101 22.3371 28.8190 32.1686 43.9088 89.7998 103.4990 131.7589 167.0849 204.2754 209.3116 228.0494 253.1210 307.0651 314.8082 322.4429 400.8680 402.7295 435.6577 460.5355 485.6805 506.4711 551.5300 610.3603 611.8917 619.6010 660.0952 660.9189 695.8986 701.1169 723.8131 750.5865 755.0177 770.4273 792.1876 854.6531 874.6241 907.9915 938.5008 941.9396 960.0780 987.8344 990.6719 1008.5309 1025.5712 1043.6667 1077.6617 1089.2700 1100.4128 1129.3956 1176.1929 1184.7502 1192.6497 1230.8750 1274.7125 1297.6428 1310.5544 1318.4369 1383.1452 1412.3860 1436.2733 1454.7870 1465.7784 1478.1952 1490.7286 1513.6723 1586.5092 1612.5709 1666.3130 3108.3505 3130.9444 3139.2411 3150.9745 3162.8537 3172.3829 3185.3496 3510.4831 3544.8252
redmass: 16.6793 9.7194 5.2230 10.8209 5.9106 6.6918 6.3964 5.7394 8.5856 15.1024 8.7283 6.1834 5.8105 7.6276 7.5660 8.0245 2.7950 5.1310 2.7423 1.8608 4.4036 5.0941 1.6498 7.6088 5.8917 7.6521 5.1563 6.4255 1.6668 6.9693 6.4618 6.1756 7.3539 3.7228 2.1240 1.2951 1.5457 7.9457 6.9384 1.4378 8.1355 2.2967 2.2197 1.3528 2.3860 4.9100 2.1520 2.5926 2.4458 5.0746 1.0579 1.0878 1.1297 2.5622 2.3567 1.9357 2.0122 1.4550 5.8804 4.3903 1.9272 3.0867 1.4850 2.5089 3.6851 3.6423 6.0516 6.0151 8.6899 1.0888 1.0852 1.0885 1.0932 1.0962 1.1005 1.0922 1.0792 1.0778
irintensity: 1.7503 2.4421 0.2669 0.0453 0.3338 0.2595 2.0986 5.9360 5.0526 0.2050 2.5815 0.3019 2.3255 7.5459 0.5139 2.3267 0.1850 3.3413 10.1819 7.5234 36.8185 15.4687 224.9239 3.4444 53.3461 2.6305 14.6948 40.9848 52.0602 10.0804 15.6833 19.7129 51.1300 40.9365 26.2627 1.8076 13.3054 5.6983 12.6965 2.1715 9.6255 1.8219 0.1044 0.7854 19.1505 53.9009 14.9761 41.1126 14.8242 53.0651 0.0590 7.2177 13.6825 26.4910 60.4974 46.1402 2.9088 1.5998 3.2812 6.0969 22.6728 5.9358 129.6082 139.5060 493.8198 120.9258 0.1465 15.2122 129.6492 7.6565 0.6123 5.2420 22.0698 11.2417 20.7301 5.6390 28.7608 91.7381
temp: 298.150 k
press: 1.00000 atm
elementType: 17 17 8 7 7 7 7 7 6 6 6 6 6 6 6 6 6 6 6 1 1 1 1 1 1 1 1 1
symmnumber: 1
zpe: 505964.9 jmol-1
zpe.correction: 0.192712 hartree
zpe.thermalcorrener: 0.209979 hartree
zpe.thermalcorrenthalpy: 0.210923 hartree
zpe.thermalcorrgfe: 0.142846 hartree
zpe.sumelectzpe: -1692.253606 hartree
zpe.sumelectthermal: -1692.236339 hartree
zpe.sumelectthermalent: -1692.235395 hartree
zpe.sumelectthermalfe: -1692.303472 hartree
dipole: 1.6218 -3.0722 4.4197
dipole: 5.6216
quadrupole: -108.4595 -132.2531 -125.1384
quadrupole: -12.8621 -12.6789 3.9530
quadrupole: 13.4908 -10.3027 -3.1881 -12.8621 -12.6789 3.9530
hfenergy: -1692.4463175 hartree
pointgroup: C01 [X(C11H9Cl2N5O1)]
dipole: -0.7189661 1.2013092 1.7122023 debye
polarizability: 242.4604305|-25.4590792|212.8739419|3.8014588|1.124833|91.0257691 unknown
InChI: InChI=1S/C11H9Cl2N5O/c12-9(13)10(19)16-18-11-15-8(6-14-17-11)7-4-2-1-3-5-7/h1-6,9,16,18H
charge 0 multiplicity 1
28 atoms
Cl 5.200044 1.776988 -0.606861
Cl 2.310369 2.75721 -0.301144
O  2.989245 -0.361339 -1.387547
N  -0.120174 -0.799808 0.416904
N  1.961795 -1.881412 0.749402
N  2.611771 -0.661216 0.903713
N  0.180056 -3.222356 0.077529
N  -1.134064 -3.343382 -0.283179
C  -2.278109 0.287539 0.064344
C  -1.436954 -0.931657 0.058391
C  -3.698125 0.21385 0.021195
C  -1.653507 1.564822 0.110787
C  0.618177 -1.941947 0.387998
C  -4.473759 1.391227 0.021461
C  -2.431599 2.739128 0.106462
C  -1.92185 -2.223715 -0.30834
C  -3.844196 2.657689 0.061535
C  3.028926 0.071392 -0.215664
C  3.563934 1.457368 0.19135
H  -4.204786 -0.757103 0.008758
H  -0.560571 1.611487 0.138417
H  -5.566495 1.322584 -0.005082
H  -1.939916 3.717506 0.132942
H  -2.945167 -2.399255 -0.644086
H  -4.448674 3.571401 0.057909
H  2.528646 -2.716449 0.584123
H  2.538864 -0.22277 1.825596
H  3.713218 1.583715 1.272088
