program: Orca
programVersion: 5.0.3
elementType: C H C H C C C H H C H H C C H H H H H H H
charge: 1
multiplicity: 1
keywords: PBE0 cc-pVTZ EnGrad RIJCOSX verytightscf cc-pVTZ/C def2/J soscf
formula: C8H13
InChI: InChI=1/C8H13/c1-2-4-6-8-7-5-3-1/h1-2,7H,3-6,8H2
21 atoms
C  -1.99973 0.656657 0.075954
H  -2.176822 0.789625 1.149028
C  -1.776259 -0.9550 -0.171945
H  -2.634828 -1.422914 0.318592
C  -0.416015 -1.352295 0.371758
C  0.667402 -1.26164 -0.412993
C  1.972108 -0.707165 0.069147
H  2.160808 -0.937577 1.12277
H  2.836899 -1.035318 -0.517111
C  1.805138 0.834445 -0.11751
H  1.839896 1.093928 -1.181518
H  2.62014 1.373606 0.373017
C  0.449934 1.365511 0.502228
C  -0.734272 1.244879 -0.332138
H  0.51779 -1.210996 -1.495325
H  -1.842668 -1.141922 -1.247337
H  0.281986 0.970285 1.50603
H  -0.643446 1.603454 -1.362534
H  -2.853884 0.989091 -0.518579
H  0.590598 2.466192 0.586044
H  -0.313465 -1.419816 1.454982
totalener: -312.04366309 hartree
nucrepener: 379.38399888 hartree
electener: -691.42766197 hartree
oneelecener: -1159.79471994 hartree
twoeener: 468.36705797 hartree
kineticenergy: 309.63076842 hartree
exchangeener: -34.148604777799 hartree
correlationener: -1.960563116502 hartree
xcener: -36.109167894301 hartree
chargesum: 1.0000000
charge: -0.175762 0.166787 -0.179721 0.158030 -0.145626 -0.132744 -0.167949 0.138369 0.150510 -0.195650 0.138503 0.152642 -0.182216 0.092749 0.149111 0.154340 0.151759 0.210094 0.169468 0.186893 0.160412
charge: 0.110925 0.014998 0.124231 0.001897 0.050549 0.045909 0.070602 -0.001426 0.004038 0.114208 -0.007629 0.000336 0.080840 0.338493 -0.016920 -0.000383 0.007508 0.021668 0.009433 0.051434 -0.020711
qa: -0.1758 0.1668 -0.1797 0.1580 -0.1456 -0.1327 -0.1679 0.1384 0.1505 -0.1956 0.1385 0.1526 -0.1822 0.0927 0.1491 0.1543 0.1518 0.2101 0.1695 0.1869 0.1604
va: 3.8373 0.9861 3.8873 0.9841 3.8180 3.8381 3.8799 0.9946 0.9881 3.8641 0.9909 0.9854 3.8955 3.5364 0.9920 0.9886 0.9966 0.9694 0.9867 0.9787 0.9933
energy: -312.043663091593
dipole: 0.35872 -0.98432 -0.62560 1.98254 -0.67248 1.31006 0.17605 -0.30150 -0.12545
magnitude: 1.45718 au
magnitude: 3.70386 debye
