program: Orca
programVersion: 5.0.3
elementType: C H C H C C C H H C H H C C H H H H H H H
charge: 1
multiplicity: 1
keywords: b3lyp cc-pVTZ EnGrad D3BJ RIJCOSX verytightscf cc-pVTZ/C def2/J soscf
formula: C8H13
InChI: InChI=1/C8H12.H/c1-2-4-6-8-7-5-3-1;/h1-2,7-8H,3-6H2;
21 atoms
C  -1.985418 0.660494 0.113949
H  -2.159244 0.852025 1.177384
C  -1.8397 -0.941439 -0.125734
H  -2.64914 -1.439582 0.410891
C  -0.46316 -1.340434 0.383749
C  0.679887 -1.265444 -0.375672
C  1.986718 -0.66094 0.102236
H  2.164582 -0.862094 1.163233
H  2.846838 -1.011246 -0.471228
C  1.840468 0.94194 -0.123453
H  1.943036 1.164995 -1.190161
H  2.649778 1.437408 0.41587
C  0.463663 1.333374 0.392653
C  -0.682346 1.27189 -0.363834
H  0.546214 -1.261884 -1.460949
H  -1.945092 -1.154707 -1.194156
H  0.001024 0.001092 0.050391
H  -0.553791 1.283938 -1.449608
H  -2.848697 1.01377 -0.45288
H  0.349386 1.325915 1.479889
H  -0.34659 -1.349007 1.470502
totalener: -312.18459562 hartree
nucrepener: 382.90014986 hartree
electener: -695.08474548 hartree
oneelecener: -1166.30256429 hartree
twoeener: 471.21781880 hartree
kineticenergy: 309.94889027 hartree
exchangeener: -36.296851546754 hartree
correlationener: -2.309371810512 hartree
xcener: -38.606223357266 hartree
chargesum: 1.0000000
charge: -0.196763 0.144342 -0.199451 0.158681 -0.041207 -0.032679 -0.196590 0.144180 0.158608 -0.199250 0.143016 0.158616 -0.040664 -0.032460 0.155913 0.143164 0.102495 0.156457 0.158699 0.157222 0.157670
charge: 0.113201 -0.004534 0.115088 0.000574 0.136358 0.145425 0.113165 -0.004600 0.000919 0.115180 -0.004911 0.000524 0.136141 0.146657 0.001184 -0.004877 -0.010590 0.001106 0.000990 0.001771 0.001228
qa: -0.1968 0.1443 -0.1995 0.1587 -0.0412 -0.0327 -0.1966 0.1442 0.1586 -0.1992 0.1430 0.1586 -0.0407 -0.0325 0.1559 0.1432 0.1025 0.1565 0.1587 0.1572 0.1577
va: 3.8504 0.9884 3.8546 0.9813 3.7667 3.7659 3.8505 0.9885 0.9812 3.8546 0.9890 0.9813 3.7668 3.7652 0.9939 0.9890 1.1107 0.9936 0.9812 0.9945 0.9942
dispcorr: -0.037080309 hartree
energy: -312.221675930770
dipole: -0.00155 -0.00163 -0.00318 0.00126 0.00174 0.00301 -0.04718 0.03865 -0.00853
magnitude: 0.00959 au
magnitude: 0.02437 debye
