program: Orca
programVersion: 5.0.3
elementType: C H C H C C C H H C H H C C H H H H H H H
charge: 1
multiplicity: 1
keywords: b3lyp cc-pVTZ EnGrad D3BJ RIJCOSX verytightscf cc-pVTZ/C def2/J soscf
formula: C8H13
InChI: InChI=1/C8H13/c1-2-4-6-8-7-5-3-1/h1-2,7H,3-6,8H2
21 atoms
C  -1.998116 0.518565 0.10349
H  -2.186623 0.741145 1.157084
C  -1.994082 -1.013781 -0.151363
H  -2.682246 -1.600507 0.457995
C  -0.541627 -1.087219 0.276721
C  0.589724 -1.075691 -0.519488
C  1.902512 -0.63288 0.045486
H  2.000067 -0.965019 1.0846
H  2.737535 -1.042175 -0.529033
C  1.928394 0.934146 -0.006728
H  2.10503 1.258945 -1.038448
H  2.757308 1.310441 0.598509
C  0.57076 1.474224 0.481802
C  -0.506538 0.720359 -0.248849
H  0.50483 -1.275442 -1.586955
H  -2.133989 -1.258303 -1.208027
H  0.455273 1.384997 1.567287
H  -0.396804 0.805291 -1.333449
H  -2.667539 1.113091 -0.523966
H  0.477033 2.539621 0.228746
H  -0.380735 -1.04138 1.354522
totalener: -312.25263501 hartree
nucrepener: 387.31926229 hartree
electener: -699.57189730 hartree
oneelecener: -1175.42915802 hartree
twoeener: 475.85726071 hartree
kineticenergy: 310.01960526 hartree
exchangeener: -36.333211748426 hartree
correlationener: -2.310596694286 hartree
xcener: -38.643808442712 hartree
chargesum: 1.0000000
charge: -0.158034 0.140958 -0.182628 0.155118 -0.013194 -0.012454 -0.188054 0.136495 0.154912 -0.192095 0.135138 0.151271 -0.173706 -0.057957 0.189727 0.139652 0.130873 0.163130 0.152965 0.160812 0.167072
charge: 0.111944 -0.001817 0.112874 -0.002669 0.119808 0.184755 0.090595 0.001382 0.005856 0.101654 -0.007458 -0.001103 0.071514 0.187528 0.003588 -0.002287 -0.004538 0.002974 -0.003519 0.015946 0.012972
qa: -0.1580 0.1410 -0.1826 0.1551 -0.0132 -0.0125 -0.1881 0.1365 0.1549 -0.1921 0.1351 0.1513 -0.1737 -0.0580 0.1897 0.1397 0.1309 0.1631 0.1530 0.1608 0.1671
va: 3.8231 0.9921 3.8448 0.9836 3.7515 3.7287 3.8721 0.9896 0.9832 3.8456 0.9868 0.9813 3.8460 3.7116 0.9758 0.9923 0.9919 0.9971 0.9814 0.9769 0.9938
dispcorr: -0.034952704 hartree
energy: -312.287587716504
dipole: 0.55209 -0.66744 -0.11535 1.84470 -1.91844 -0.07374 0.21434 -0.38262 -0.16828
magnitude: 0.21694 au
magnitude: 0.55141 debye
