program: Orca
programVersion: 5.0.3
elementType: C H C H C C C H H C H H C C H H H H H H H
charge: 1
multiplicity: 1
keywords: DSD-PBEP86/2013 def2-TZVP RIJCOSX verytightscf def2-TZVP/C def2/J soscf noTRAH
formula: C8H13
InChI: InChI=1/C8H13/c1-2-4-6-8-7-5-3-1/h1-2,7H,3-6,8H2
21 atoms
C  -1.99864 0.740193 0.076555
H  -2.189522 0.862388 1.146201
C  -1.747069 -0.940491 -0.147572
H  -2.61837 -1.33836 0.377924
C  -0.42637 -1.36954 0.403275
C  0.694078 -1.284067 -0.366973
C  2.006658 -0.687466 0.067245
H  2.219205 -0.878119 1.124935
H  2.858618 -1.026202 -0.526985
C  1.797813 0.887788 -0.145122
H  1.854647 1.130854 -1.2114
H  2.608443 1.422514 0.354925
C  0.422771 1.257858 0.455117
C  -0.755925 1.317662 -0.377311
H  0.529621 -1.21325 -1.446726
H  -1.844554 -1.123685 -1.218886
H  0.118308 0.310124 0.967057
H  -0.630205 1.419229 -1.459126
H  -2.872845 0.985835 -0.526567
H  0.39291 1.896097 1.352771
H  -0.346121 -1.513078 1.48242
totalener: -311.10640023 hartree
nucrepener: 380.60832536 hartree
electener: -691.71472559 hartree
oneelecener: -1161.51568217 hartree
twoeener: 469.80095657 hartree
kineticenergy: 309.97132687 hartree
exchangeener: -12.752523615963 hartree
correlationener: -0.945244707990 hartree
xcener: -13.697768323953 hartree
chargesum: 1.0000000
charge: -0.243858 0.189867 -0.245270 0.193044 -0.156932 -0.129651 -0.205278 0.158653 0.167990 -0.306958 0.161478 0.173091 -0.087903 0.079471 0.144926 0.182760 0.107207 0.203657 0.195079 0.232760 0.185866
charge: -0.172867 0.162829 -0.143365 0.159154 -0.202906 -0.110709 -0.209743 0.148311 0.147830 -0.200003 0.142520 0.150683 -0.216210 0.141595 0.151437 0.152275 0.226268 0.172454 0.159353 0.189290 0.151803
qa: -0.2439 0.1899 -0.2453 0.1930 -0.1569 -0.1297 -0.2053 0.1587 0.1680 -0.3070 0.1615 0.1731 -0.0879 0.0795 0.1449 0.1828 0.1072 0.2037 0.1951 0.2328 0.1859
va: 3.8421 0.9642 3.9047 0.9573 3.7523 3.9068 3.8454 0.9716 0.9732 3.9309 0.9659 0.9708 3.6351 3.6292 0.9668 0.9613 1.0642 0.9474 0.9638 0.9423 0.9589
total: -311.795673922 hartree
energy: -311.795673922223
dipole: 0.07513 -0.85280 -0.77768 0.87611 0.16683 1.04294 0.39056 -0.50799 -0.11743
magnitude: 1.30625 au
magnitude: 3.32023 debye
