program: Gaussian 09
title: 000051303
version: EM64L-G09RevD.01
frameworkgroup: C1[X(C23H24O4S)]
method: RPBEPBE
basis: SDD
operation: Freq
keyword: #p
keyword: freq=noraman
keyword: PBEPBE/SDD
title: #p freq=noraman PBEPBE/SDD
converged: YES YES NO NO
title: Mulliken charges:
elementType: S O O O O C C C C C C C C C C C C C C C C C C C C C C C H H H H H H H H H H H H H H H H H H H H H H H H
charge: 0.178730 -0.264800 -0.293900 -0.187478 -0.234109 0.313159 -0.311074 -0.373617 -0.725529 -0.746425 -0.226167 0.310196 0.378321 -0.489976 -0.302843 -0.709379 -0.504107 0.434434 -0.500491 -0.339353 0.334791 -0.654271 0.475909 -0.373968 -0.422164 -0.228199 -0.238457 -0.256524 0.312903 0.273947 0.225334 0.219012 0.223770 0.215742 0.217411 0.256648 0.251516 0.240918 0.243156 0.264569 0.310105 0.229994 0.243624 0.287266 0.274202 0.251380 0.234884 0.245220 0.230861 0.237506 0.228058 0.239266
chargesum: 0.00000
title: Mulliken charges with hydrogens summed into heavy atoms:
elementType: S O O O O C C C C C C C C C C C C C C C C C C C C C C C
charge: 0.178730 -0.264800 -0.293900 -0.187478 -0.234109 0.313159 0.001829 -0.099670 -0.057414 -0.056624 0.025349 0.310196 0.378321 -0.005902 -0.302843 -0.134705 -0.030489 0.434434 -0.213225 -0.065151 0.334791 -0.168007 0.475909 -0.128748 -0.191303 0.009308 -0.010400 -0.017258
polarizability: 2.78170764e+02 -3.40625536e+01 3.38720334e+02 -2.61037136e+01 9.99541376e+00 2.11564493e+02
1716.lowfreq: -14.5894 -5.9795 -4.2727 -0.0014 -0.0008 0.0009 4.2417 9.5112 17.7409
frequency: -13.8986 8.8153 17.6542 25.4583 33.7006 41.5186 46.0383 60.6380 69.3336 85.9422 101.0881 125.1407 139.9398 157.9243 163.2827 172.2355 191.1586 203.7851 222.4468 225.1166 244.0781 265.5133 274.4436 292.7601 311.2543 334.5107 352.9658 364.1489 372.5002 393.7832 402.5001 404.1612 449.7487 460.4658 461.9866 466.3078 494.0697 559.9497 561.8900 599.2622 615.9379 618.3311 627.7878 630.6501 646.0416 683.3879 697.5499 700.5628 707.4165 730.4615 739.7468 757.5321 776.3668 790.9617 801.3553 830.6181 843.9410 854.4416 856.3882 860.2366 874.1189 906.2522 915.0350 925.1724 943.4939 952.4809 961.8353 968.6507 974.0398 977.6591 990.1404 992.3049 995.0499 997.8724 1001.3661 1008.6836 1026.2297 1045.6164 1070.7525 1079.1953 1093.1823 1119.0187 1125.2869 1127.7237 1133.6341 1150.3269 1166.4465 1170.7080 1172.0170 1188.5003 1197.2816 1200.5258 1212.7542 1248.9251 1250.1545 1251.6140 1281.5901 1305.4129 1306.6066 1314.9220 1322.5142 1340.3667 1344.1810 1381.1691 1382.5681 1388.4764 1395.4357 1403.0160 1413.2421 1439.0021 1450.0540 1451.1010 1453.8778 1463.4750 1464.0696 1466.2626 1482.4975 1483.5349 1495.2306 1540.9193 1592.3975 1603.4151 1609.3700 1612.6980 1613.4890 1643.9424 2973.8330 2979.5669 2984.1387 2984.2467 3034.1848 3038.6696 3042.4161 3057.5374 3064.9752 3069.0513 3078.6681 3104.7280 3113.2405 3115.5400 3117.6437 3125.6045 3126.1306 3134.6751 3144.2865 3146.8762 3153.9651 3163.3089 3227.2769 3251.4959
redmass: 4.0870 6.0177 6.3781 4.5930 6.5545 5.3230 4.7002 7.5012 5.9586 4.8575 3.5139 4.7565 4.4075 4.2193 2.2828 2.1067 1.8024 3.1871 2.6976 1.3446 4.4941 5.2691 3.0461 3.9665 3.3639 4.1325 3.5784 3.5304 2.3899 5.1022 4.5081 2.8685 4.6420 3.0586 4.1567 3.6536 4.0236 5.4724 4.8989 4.2098 4.6629 4.4951 6.6508 4.5937 3.7076 4.9835 3.1992 5.2537 2.1695 1.7987 3.9206 2.0604 3.2922 3.8324 3.9443 3.8887 2.6968 1.3687 1.6668 2.2255 1.8994 1.7449 4.1379 1.6095 2.5614 2.0797 1.3612 1.7618 2.0772 1.3874 6.0807 1.9919 2.7033 1.3240 1.5594 1.5256 2.2508 2.3035 1.5130 1.6412 4.3644 1.8769 2.2776 1.6999 1.2870 1.3665 1.7148 2.2077 1.0563 1.1106 1.9734 2.5442 1.2691 1.2427 2.1522 1.5856 1.2160 1.6775 1.4118 2.2986 1.4325 1.3992 1.3295 1.6765 6.6609 1.3164 3.8930 1.3289 1.7739 2.0223 1.1549 1.0884 1.1256 1.0893 1.0594 1.0508 1.1062 2.2118 1.0588 6.9404 6.0836 7.4310 9.8867 7.1470 6.6506 7.7090 1.0356 1.0637 1.0563 1.0409 1.0997 1.0595 1.0643 1.0912 1.0994 1.0986 1.0997 1.0981 1.0872 1.1063 1.0900 1.0889 1.1070 1.0914 1.0883 1.0960 1.0900 1.1014 1.0989 1.1006
irintensity: 0.2028 0.3039 0.4225 0.4062 0.9492 1.1164 1.9607 3.1076 1.6188 5.0584 1.4803 1.5627 0.2327 0.3539 1.4045 0.3609 1.7504 2.8242 4.2458 1.3255 4.5267 5.8503 1.6055 3.5570 10.1362 4.4922 3.3616 4.0326 6.2910 1.0052 5.2409 0.0656 1.6505 10.6583 0.5980 1.5219 0.9283 4.9105 21.5093 4.1865 2.0588 6.2223 17.5455 3.3088 3.1632 4.3318 10.1125 4.7828 23.1217 100.4308 70.4521 40.6083 31.4853 77.3665 5.4989 5.4648 37.0746 3.9864 12.5602 25.9308 17.9844 18.3777 158.6863 51.9575 7.4550 8.6402 1.5216 8.6469 6.4843 0.0264 0.6807 11.7901 1.7764 1.4390 21.6260 8.7393 5.9804 139.5489 194.2580 10.2685 12.0113 130.9584 31.0152 30.9769 40.1039 14.7469 21.4564 12.7846 0.2727 1.6734 21.8641 1.7460 3.5001 12.7772 2.3147 6.0177 20.5413 2.3437 16.2429 5.9814 50.7931 1.8204 35.8397 81.9148 0.5642 45.1340 4.6833 18.9861 61.6192 5.4795 21.2130 13.6189 26.8537 2.3509 4.1271 7.8224 5.2721 18.0887 7.5509 26.1727 0.2411 16.0053 91.5072 104.3716 26.6456 170.1577 34.3128 22.0921 33.1068 34.5129 5.6841 36.7756 11.0308 15.4754 0.3053 50.6292 28.6281 6.8731 8.2207 7.3605 6.3641 1.5496 11.0166 11.5062 7.3469 34.8745 9.3972 11.9301 2.1680 0.2160
temp: 298.150 k
press: 1.00000 atm
elementType: 16 8 8 8 8 6 6 6 6 6 6 6 6 6 6 6 6 6 6 6 6 6 6 6 6 6 6 6 1 1 1 1 1 1 1 1 1 1 1 1 1 1 1 1 1 1 1 1 1 1 1 1
symmnumber: 1
zpe: 1082729.1 jmol-1
zpe.correction: 0.412390 hartree
zpe.thermalcorrener: 0.438716 hartree
zpe.thermalcorrenthalpy: 0.439660 hartree
zpe.thermalcorrgfe: 0.352310 hartree
zpe.sumelectzpe: -1587.727223 hartree
zpe.sumelectthermal: -1587.700896 hartree
zpe.sumelectthermalent: -1587.699952 hartree
zpe.sumelectthermalfe: -1587.787302 hartree
dipole: -0.3831 -2.4795 3.0217
dipole: 3.9275
quadrupole: -163.0628 -169.2776 -171.6964
quadrupole: -11.1257 -2.7697 15.0159
quadrupole: 4.9495 -1.2654 -3.6841 -11.1257 -2.7697 15.0159
hfenergy: -1588.1396126 hartree
pointgroup: C01 [X(C23H24O4S1)]
dipole: -0.1617129 -0.7924212 -1.3166486 debye
polarizability: 288.969931|47.6623648|322.3167377|-27.6046016|8.1129933|217.1689224 unknown
InChI: InChI=1S/C23H24O4S/c1-23(2)19(12-17-8-9-28-22(17)25)20(23)21(24)27-14-16-11-18(26-13-16)10-15-6-4-3-5-7-15/h3-7,11-13,19-20H,8-10,14H2,1-2H3
charge 0 multiplicity 1
52 atoms
S  0.204141 4.548416 1.102647
O  -1.99388 -2.811247 0.215859
O  -2.182047 -1.264846 -1.52646
O  -1.791566 3.081777 2.312187
O  2.448721 -3.711923 -0.0415
C  -4.299479 0.127719 0.429635
C  -2.93784 0.794873 0.749926
C  -3.075345 -0.778383 0.719914
C  -5.344156 0.189358 1.544858
C  -4.893692 0.20368 -0.975231
C  -2.160236 1.509483 -0.279633
C  -2.397084 -1.583487 -0.325455
C  -1.385323 2.626749 -0.088938
C  -0.647254 3.332805 -1.215409
C  -1.183244 3.28195 1.235021
C  0.646266 3.956049 -0.645543
C  -1.225883 -3.727021 -0.708178
C  0.24756 -3.483455 -0.609175
C  0.999511 -2.395569 -1.212722
C  1.163408 -4.255396 0.088384
C  2.326899 -2.551096 -0.854541
C  3.599462 -1.797614 -1.111607
C  3.644021 -0.375501 -0.539721
C  3.022342 -0.053455 0.693209
C  4.362551 0.636238 -1.225083
C  3.119612 1.249586 1.230374
C  4.467465 1.939846 -0.687849
C  3.845521 2.251299 0.543494
H  -2.845595 1.202117 1.760653
H  -3.053694 -1.255372 1.703583
H  -5.924218 1.128223 1.473687
H  -6.051427 -0.657546 1.464568
H  -4.879948 0.155891 2.546717
H  -5.697329 -0.54871 -1.081835
H  -5.340924 1.20126 -1.141264
H  -4.151188 0.012897 -1.765696
H  -2.199646 1.092795 -1.294942
H  -1.287034 4.142079 -1.621272
H  -0.414246 2.642681 -2.045696
H  0.991316 4.827017 -1.222344
H  1.457157 3.217378 -0.54915
H  -1.503161 -4.731293 -0.353094
H  -1.599491 -3.558686 -1.732806
H  0.581642 -1.597254 -1.822914
H  1.085065 -5.158192 0.68818
H  4.426386 -2.391712 -0.6750
H  3.794073 -1.751631 -2.200101
H  2.454482 -0.822631 1.229312
H  4.845162 0.402429 -2.182791
H  2.628137 1.486933 2.18042
H  5.030631 2.708884 -1.228963
H  3.921797 3.260307 0.964284
