program: Gaussian 09
title: 000051149
version: EM64L-G09RevD.01
frameworkgroup: C1[X(C18H36O2)]
method: RPBEPBE
basis: SDD
operation: Freq
keyword: #pfreq=noraman
keyword: PBEPBE/SDD
title: #p freq=noraman PBEPBE/SDD
converged: YES YES NO NO
title: Mulliken charges:
elementType: O O C C C C C C C C C C C C C C C C C C H H H H H H H H H H H H H H H H H H H H H H H H H H H H H H H H H H H H
charge: -0.351119 -0.449401 0.496840 -0.505455 -0.512412 -0.510373 -0.398677 -0.409790 -0.389591 -0.396666 -0.385900 -0.388238 -0.267770 -0.384880 -0.382631 -0.332331 -0.372795 -0.353505 -0.356735 -0.696542 0.203896 0.205009 0.192666 0.230946 0.212424 0.203225 0.214380 0.194479 0.196105 0.204462 0.205762 0.184258 0.219826 0.210088 0.191392 0.191565 0.196556 0.193132 0.207273 0.187275 0.191568 0.194112 0.193385 0.191436 0.198158 0.206197 0.190106 0.188432 0.187324 0.188284 0.194362 0.194993 0.350446 0.215031 0.209802 0.209612
chargesum: 0.00000
title: Mulliken charges with hydrogens summed into heavy atoms:
elementType: O O C C C C C C C C C C C C C C C C C C
charge: -0.351119 -0.098955 0.496840 -0.096550 -0.088800 -0.094723 0.010182 -0.009223 0.000429 0.033249 -0.002942 0.001450 0.126778 0.000801 0.002191 0.072024 0.005743 0.022103 0.032619 -0.062097
polarizability: 2.47516782e+02 5.53005769e+00 1.84670890e+02 -9.26041615e-01 -2.42906497e+00 1.72006565e+02
1716.lowfreq: -1.6287 -0.0014 0.0009 0.0013 2.9237 8.2103 15.5557 26.8175 30.9173
frequency: 15.4559 26.7993 30.8032 35.1104 46.2163 56.6360 68.1309 75.8934 82.3943 111.6199 117.2142 120.5198 138.3727 142.7371 146.6775 148.8626 160.7530 202.9056 228.3347 229.2365 240.6580 287.2150 292.4337 300.4167 319.2611 353.0979 376.7326 419.4017 431.4379 455.2556 477.9551 481.1833 486.3483 503.4934 518.5556 611.9884 715.7539 719.5449 722.1911 729.6421 746.7085 766.6937 776.7446 797.0098 832.5154 845.8027 866.4455 874.9229 887.7810 897.2467 907.0541 919.7965 926.9616 952.6412 966.0689 986.3120 997.2073 998.7440 1016.8695 1024.0380 1045.0368 1048.0599 1052.3858 1057.4593 1070.7239 1073.3140 1080.2451 1081.5398 1083.7906 1092.9698 1100.8452 1121.4878 1125.6489 1147.3425 1160.4291 1182.8515 1187.6333 1197.7228 1207.8720 1210.5115 1225.9425 1238.1243 1246.4616 1254.5849 1264.1654 1269.9003 1275.4094 1278.3631 1279.6992 1286.5426 1291.9326 1294.7350 1304.4370 1308.4145 1324.4459 1326.1521 1330.8951 1337.7928 1340.7788 1347.1000 1349.7856 1353.5630 1355.7541 1356.4510 1361.8952 1366.5287 1382.7933 1389.9895 1449.7923 1456.4026 1459.5774 1459.7804 1461.1552 1461.9361 1463.2127 1463.2740 1465.6236 1466.4247 1471.0005 1473.2080 1476.5353 1477.2044 1477.8649 1482.8572 1487.5295 1489.3507 2946.2033 2948.2384 2949.4694 2949.8013 2951.2804 2955.5222 2958.7608 2960.8743 2961.5505 2967.1719 2967.7672 2970.0677 2971.6885 2976.2931 2978.0437 2980.0632 2981.1913 2983.8165 2984.6068 2990.9622 3000.0754 3004.5259 3014.6800 3017.0659 3023.3137 3027.9332 3028.4309 3036.0308 3038.7258 3043.4592 3046.7370 3056.0441 3068.2806 3070.2096 3078.9491 3520.8222
redmass: 4.2712 3.4526 1.9844 2.9421 3.6342 3.9697 1.8334 3.0047 2.8275 1.6927 3.2884 2.8013 2.8102 2.6525 1.9404 2.2747 3.9359 2.7018 2.0721 1.2197 2.4726 2.5090 2.7936 2.9964 2.7874 2.4350 2.2852 2.3243 2.9197 3.0667 1.5790 2.4928 1.7021 2.3962 2.5294 2.5922 3.2557 1.0600 1.0727 1.1121 1.1910 1.5084 1.4498 1.6515 1.3153 2.1703 1.5423 2.7928 1.9061 1.5576 2.3531 1.4360 1.8515 2.3332 1.2609 4.4363 3.5081 3.0759 1.1912 3.3157 3.2441 1.9891 2.6725 2.2772 1.5865 2.0386 2.0461 2.0140 1.9401 1.7071 1.5594 2.2617 2.3222 1.7085 2.3221 1.8058 1.2568 1.3271 1.2417 1.4714 1.5644 1.3509 1.3844 1.3260 1.2667 1.2461 1.1814 1.2051 1.1580 1.0632 1.1513 1.0964 1.3265 1.2640 1.4073 1.2575 1.4361 1.4251 1.4828 1.4731 1.5287 1.6844 1.6200 1.4503 1.4598 1.5105 1.2501 1.2178 1.0852 1.0834 1.0749 1.0730 1.0790 1.0881 1.0828 1.0688 1.0815 1.0818 1.0812 1.0797 1.0725 1.0574 1.0865 1.0868 1.0896 1.0975 1.0586 1.0586 1.0580 1.0580 1.0593 1.0593 1.0597 1.0638 1.0588 1.0682 1.0587 1.0613 1.0366 1.0595 1.0623 1.0630 1.0959 1.0631 1.0972 1.0993 1.1000 1.0999 1.1037 1.1024 1.0987 1.1045 1.0949 1.1018 1.1045 1.1021 1.1027 1.1001 1.1006 1.0993 1.0969 1.0649
irintensity: 0.2636 0.3454 0.1016 0.3676 1.6598 1.3156 0.0255 0.0210 0.0479 0.0057 1.7740 0.7296 0.2851 0.2064 0.0431 0.2130 1.4382 7.0521 0.3467 0.0730 2.2235 0.0956 2.1358 6.1634 1.0134 2.7648 1.4490 3.0236 0.7295 2.2751 110.8339 14.8382 26.3788 18.4899 25.4291 0.9219 4.2046 17.1854 0.2307 3.1202 1.1208 0.7491 1.0652 4.2444 0.6038 7.0720 0.5447 22.0664 4.6620 5.7607 5.4336 10.5558 27.4460 21.0542 2.5953 1.0268 42.5408 53.0260 2.8138 0.9751 43.3475 2.9327 14.1913 3.7193 0.7331 0.4237 0.2366 0.5129 2.2689 4.7795 0.4571 5.4433 17.4765 2.3648 16.8192 0.3839 9.3471 6.3235 22.2513 3.5839 2.6939 0.6862 2.0480 3.1686 1.9050 2.4458 2.8282 2.8479 0.2122 0.5979 0.2621 0.0508 3.9946 5.3028 5.2930 14.2911 1.4629 1.7062 1.1125 4.0906 1.3006 0.1953 0.1517 0.7293 2.6841 4.1007 24.9990 11.3301 6.2628 0.1714 0.3381 0.1771 3.8225 9.6755 1.0702 0.8154 0.6398 3.3715 1.5855 29.2789 6.2371 4.3130 10.4392 1.0106 3.0362 35.5442 4.1319 0.0929 15.0900 7.0490 1.4351 0.5488 16.2014 40.4328 71.2630 43.8825 154.8217 16.1098 37.4174 92.6923 52.0786 32.7528 1.1843 20.9074 0.9400 1.1036 2.8640 2.0313 10.7958 50.3512 66.8661 4.7591 63.6412 22.4839 74.5182 7.0638 269.5334 65.6947 97.1273 55.8778 40.5383 10.6467
temp: 298.150 k
press: 1.00000 atm
elementType: 8 8 6 6 6 6 6 6 6 6 6 6 6 6 6 6 6 6 6 6 1 1 1 1 1 1 1 1 1 1 1 1 1 1 1 1 1 1 1 1 1 1 1 1 1 1 1 1 1 1 1 1 1 1 1 1
symmnumber: 1
zpe: 1337046.4 jmol-1
zpe.correction: 0.509254 hartree
zpe.thermalcorrener: 0.534011 hartree
zpe.thermalcorrenthalpy: 0.534955 hartree
zpe.thermalcorrgfe: 0.451400 hartree
zpe.sumelectzpe: -856.276439 hartree
zpe.sumelectthermal: -856.251682 hartree
zpe.sumelectthermalent: -856.250738 hartree
zpe.sumelectthermalfe: -856.334293 hartree
dipole: 1.9241 -2.0570 -1.4103
dipole: 3.1499
quadrupole: -145.2528 -130.6994 -127.8769
quadrupole: 14.5048 4.5247 -3.6485
quadrupole: -10.6431 3.9103 6.7328 14.5048 4.5247 -3.6485
hfenergy: -856.785693 hartree
pointgroup: C01 [X(C18H36O2)]
dipole: 0.7387005 -0.8326682 -0.5447975 debye
polarizability: 247.7159476|4.1896922|184.396724|-1.1993947|-2.5923444|172.081565 unknown
InChI: InChI=1S/C18H36O2/c1-2-3-4-5-6-7-8-10-13-18(20-17-16-19)14-11-9-12-15-18/h19H,2-17H2,1H3
charge 0 multiplicity 1
56 atoms
O  -3.185204 0.887655 0.280076
O  -4.850094 3.088411 0.645167
C  -3.06366 -0.509207 -0.251015
C  -4.183356 -0.812526 -1.285826
C  -3.260216 -1.382658 1.013596
C  -1.667781 -0.714216 -0.898522
C  -5.605319 -0.680261 -0.697284
C  -4.686336 -1.277616 1.603311
C  -5.772643 -1.58443 0.546715
C  -0.458491 -0.427585 0.018348
C  0.881415 -0.433714 -0.751673
C  2.113239 -0.257691 0.164522
C  -3.074975 1.998648 -0.675904
C  3.452563 -0.234638 -0.606142
C  4.688563 -0.132488 0.315894
C  -3.48756 3.238435 0.124852
C  6.027618 -0.100608 -0.455237
C  7.265688 -0.040888 0.467702
C  8.604515 -0.005259 -0.304508
C  9.836361 0.037308 0.625507
H  -4.068619 -0.164396 -2.176863
H  -4.032056 -1.852191 -1.642413
H  -3.04584 -2.435481 0.738293
H  -2.517656 -1.082124 1.774525
H  -1.611561 -1.758578 -1.267793
H  -1.598437 -0.07102 -1.801457
H  -5.793884 0.374991 -0.416663
H  -6.353858 -0.945005 -1.469065
H  -4.781591 -1.968509 2.4635
H  -4.835177 -0.253226 1.99655
H  -6.780601 -1.452114 0.985065
H  -5.693924 -2.647938 0.23673
H  -0.601346 0.550842 0.518638
H  -0.41064 -1.184903 0.826259
H  0.979889 -1.386849 -1.313338
H  0.871769 0.37406 -1.513847
H  2.007687 0.681534 0.746862
H  2.133949 -1.08225 0.907741
H  -3.765575 1.856068 -1.531165
H  -2.037425 2.103544 -1.058266
H  3.534319 -1.153692 -1.224044
H  3.452768 0.617931 -1.317299
H  4.605157 0.779509 0.943587
H  4.691486 -0.99262 1.017944
H  -2.76522 3.399963 0.952577
H  -3.503353 4.132205 -0.521562
H  6.036699 0.774365 -1.138662
H  6.097928 -1.000133 -1.102585
H  7.259478 -0.91925 1.146871
H  7.19659 0.855234 1.1197
H  8.667669 -0.895508 -0.963474
H  8.614123 0.878194 -0.975304
H  -4.876019 2.192735 1.075098
H  10.779941 0.065083 0.049828
H  9.810852 0.931931 1.276251
H  9.866751 -0.852675 1.282303
