program: Orca
programVersion: 5.0.3
elementType: C H C H C C C H H C H H C C H H H H H H H
charge: 1
multiplicity: 1
keywords: m062x cc-pVTZ EnGrad RIJCOSX verytightscf cc-pVTZ/C def2/J soscf
formula: C8H13
InChI: InChI=1/C8H13/c1-2-4-6-8-7-5-3-1/h1-2,7H,3-6,8H2
21 atoms
C  -1.997926 0.759291 0.070889
H  -2.164458 0.836829 1.148079
C  -1.731325 -0.96264 -0.156072
H  -2.618362 -1.316235 0.373912
C  -0.418395 -1.385261 0.39445
C  0.687402 -1.27807 -0.375163
C  2.002441 -0.690367 0.06334
H  2.211622 -0.88548 1.120773
H  2.856399 -1.033097 -0.52671
C  1.790388 0.863746 -0.142016
H  1.835403 1.121821 -1.205643
H  2.594731 1.410501 0.356915
C  0.421701 1.256836 0.484816
C  -0.767445 1.304256 -0.376313
H  0.523296 -1.205301 -1.454993
H  -1.835898 -1.124823 -1.229258
H  0.178846 0.532003 1.269922
H  -0.657747 1.565464 -1.432495
H  -2.881311 0.988865 -0.523431
H  0.4551 2.202285 1.062891
H  -0.337896 -1.491473 1.476051
totalener: -312.26362931 hartree
nucrepener: 379.62611325 hartree
electener: -691.88974257 hartree
oneelecener: -1159.99607907 hartree
twoeener: 468.10633650 hartree
kineticenergy: 310.02695210 hartree
xcener: -23.083210356211 hartree
chargesum: 1.0000000
charge: -0.322556 0.224773 -0.287701 0.208378 -0.148809 -0.128106 -0.293571 0.178150 0.183684 -0.297516 0.183669 0.186744 -0.265328 0.108578 0.187965 0.210160 0.164705 0.254894 0.208397 0.239816 0.203675
charge: 0.128422 0.013974 0.172046 0.008127 0.017400 0.069288 0.075501 -0.003704 -0.002693 0.104551 -0.011425 -0.000484 0.074378 0.312126 -0.015831 0.000048 0.008697 0.019199 0.006659 0.043427 -0.019706
qa: -0.3226 0.2248 -0.2877 0.2084 -0.1488 -0.1281 -0.2936 0.1781 0.1837 -0.2975 0.1837 0.1867 -0.2653 0.1086 0.1880 0.2102 0.1647 0.2549 0.2084 0.2398 0.2037
va: 3.7420 0.9411 3.7744 0.9481 3.6226 3.6553 3.7769 0.9617 0.9595 3.7339 0.9567 0.9569 3.7230 3.3595 0.9564 0.9468 0.9828 0.9293 0.9562 0.9359 0.9540
energy: -312.263629314245
dipole: 0.14952 -1.03297 -0.88345 1.49943 -0.39493 1.10450 0.40836 -0.52778 -0.11942
magnitude: 1.41939 au
magnitude: 3.60781 debye
