program: Orca
programVersion: 5.0.3
elementType: C H C H C C C H H C H H C C H H H H H H H
charge: 1
multiplicity: 1
keywords: PBE0 cc-pVTZ EnGrad RIJCOSX verytightscf cc-pVTZ/C def2/J soscf
formula: C8H13
InChI: InChI=1/C8H13/c1-2-4-6-8-7-5-3-1/h1-2,7H,3-6,8H2
21 atoms
C  -2.001344 0.727767 0.079537
H  -2.201806 0.871367 1.145006
C  -1.75799 -0.931792 -0.144885
H  -2.618778 -1.358028 0.375334
C  -0.428817 -1.359984 0.407655
C  0.696907 -1.284661 -0.364757
C  2.008421 -0.687173 0.069732
H  2.221754 -0.878894 1.126847
H  2.859162 -1.022698 -0.527471
C  1.800832 0.895471 -0.144384
H  1.859558 1.132296 -1.211893
H  2.614305 1.42458 0.356146
C  0.424322 1.268093 0.441574
C  -0.746108 1.319541 -0.372391
H  0.530591 -1.210112 -1.4440
H  -1.849172 -1.126473 -1.215559
H  0.084493 0.22092 0.797275
H  -0.609477 1.358177 -1.457354
H  -2.869716 0.990636 -0.525399
H  0.371641 1.745746 1.429278
H  -0.34739 -1.517836 1.485213
totalener: -312.00980925 hartree
nucrepener: 381.16451246 hartree
electener: -693.17432171 hartree
oneelecener: -1163.11748243 hartree
twoeener: 469.94316072 hartree
kineticenergy: 309.60486682 hartree
exchangeener: -34.140083298841 hartree
correlationener: -1.968778571402 hartree
xcener: -36.108861870243 hartree
chargesum: 1.0000000
charge: -0.193952 0.160870 -0.206888 0.167679 -0.120301 -0.064027 -0.183587 0.139832 0.152653 -0.204397 0.143085 0.154984 -0.152181 0.075755 0.148336 0.158716 0.123204 0.176924 0.171943 0.187182 0.164171
charge: 0.116168 0.005872 0.134947 0.007373 0.043801 0.114293 0.086638 -0.002661 -0.001080 0.113204 -0.008010 -0.000260 0.094239 0.258418 -0.009500 -0.002655 0.008393 0.009602 0.007165 0.032201 -0.008150
qa: -0.1940 0.1609 -0.2069 0.1677 -0.1203 -0.0640 -0.1836 0.1398 0.1527 -0.2044 0.1431 0.1550 -0.1522 0.0758 0.1483 0.1587 0.1232 0.1769 0.1719 0.1872 0.1642
va: 3.8624 0.9871 3.9108 0.9820 3.8124 3.8184 3.8777 0.9936 0.9855 3.8945 0.9930 0.9884 3.8244 3.6624 0.9916 0.9871 1.0810 0.9842 0.9825 0.9887 0.9941
energy: -312.009809253729
dipole: 0.04235 -0.53551 -0.49315 0.59061 0.02536 0.61597 0.31273 -0.34268 -0.02995
magnitude: 0.78963 au
magnitude: 2.00707 debye
