program: Orca
programVersion: 5.0.3
elementType: C H C H C C C H H C H H C C H H H H H H H
charge: 1
multiplicity: 1
keywords: b3lyp cc-pVTZ EnGrad D3BJ RIJCOSX verytightscf cc-pVTZ/C def2/J soscf
formula: C8H13
InChI: InChI=1/C8H13/c1-2-4-6-8-7-5-3-1/h1-2,7H,3-6,8H2
21 atoms
C  -1.997597 0.758467 0.071335
H  -2.165969 0.839453 1.148032
C  -1.732194 -0.960571 -0.155077
H  -2.618367 -1.316292 0.375022
C  -0.419301 -1.384283 0.39518
C  0.688008 -1.27887 -0.374111
C  2.002897 -0.6898 0.063608
H  2.212545 -0.883932 1.121154
H  2.856642 -1.03254 -0.526655
C  1.791057 0.866481 -0.142686
H  1.837651 1.123238 -1.206525
H  2.595788 1.412246 0.356606
C  0.421678 1.255266 0.482487
C  -0.767054 1.305825 -0.377363
H  0.524083 -1.206872 -1.454007
H  -1.836727 -1.124015 -1.228095
H  0.173868 0.508873 1.246443
H  -0.656648 1.55299 -1.436767
H  -2.88058 0.987655 -0.523847
H  0.448727 2.177833 1.094674
H  -0.339066 -1.49357 1.476637
totalener: -312.20291822 hartree
nucrepener: 379.70033381 hartree
electener: -691.90325203 hartree
oneelecener: -1160.42940945 hartree
twoeener: 468.52615742 hartree
kineticenergy: 309.98389085 hartree
exchangeener: -36.295339790119 hartree
correlationener: -2.304013789698 hartree
xcener: -38.599353579817 hartree
chargesum: 1.0000000
charge: -0.198088 0.168232 -0.191045 0.174848 -0.115644 -0.085742 -0.170490 0.126538 0.146249 -0.203816 0.132489 0.150192 -0.181394 0.108016 0.134867 0.163038 0.131294 0.197368 0.176405 0.190846 0.145835
charge: 0.133835 0.011667 0.172759 0.007453 0.023521 0.081358 0.080976 -0.005954 -0.004853 0.109887 -0.013594 -0.002384 0.081725 0.299403 -0.017668 -0.002244 0.007989 0.012559 0.005285 0.040963 -0.022683
qa: -0.1981 0.1682 -0.1910 0.1748 -0.1156 -0.0857 -0.1705 0.1265 0.1462 -0.2038 0.1325 0.1502 -0.1814 0.1080 0.1349 0.1630 0.1313 0.1974 0.1764 0.1908 0.1458
va: 3.8330 0.9815 3.8589 0.9723 3.7904 3.7994 3.8537 0.9935 0.9831 3.8446 0.9905 0.9817 3.8276 3.5485 0.9929 0.9812 1.0147 0.9741 0.9792 0.9727 0.9969
dispcorr: -0.036824246 hartree
energy: -312.239742467499
dipole: 0.14222 -0.98790 -0.84567 1.44662 -0.42460 1.02202 0.41460 -0.51151 -0.09691
magnitude: 1.33007 au
magnitude: 3.38077 debye
