program: Orca
programVersion: 5.0.3
elementType: C H C H C C C H H C H H C C H H H H H H H
charge: 1
multiplicity: 1
keywords: DSD-PBEP86 cc-pVTZ EnGrad RIJCOSX verytightscf cc-pVTZ/C def2/J soscf
formula: C8H13
InChI: InChI=1/C8H13/c1-2-4-6-8-7-5-3-1/h1-2,7H,3-6,8H2
21 atoms
C  -1.997337 0.757331 0.071798
H  -2.167639 0.84189 1.14797
C  -1.733191 -0.958497 -0.154131
H  -2.618429 -1.316644 0.375989
C  -0.420172 -1.383194 0.395913
C  0.688589 -1.279648 -0.373114
C  2.003315 -0.689343 0.063908
H  2.213385 -0.882647 1.121545
H  2.856885 -1.0320 -0.526581
C  1.791758 0.869113 -0.143279
H  1.83982 1.124452 -1.20731
H  2.596901 1.413803 0.356302
C  0.42177 1.254446 0.479802
C  -0.76655 1.307345 -0.378189
H  0.52484 -1.208354 -1.453094
H  -1.837481 -1.123369 -1.226995
H  0.168956 0.487078 1.224729
H  -0.655465 1.541149 -1.441054
H  -2.879794 0.986557 -0.524294
H  0.442005 2.149562 1.126315
H  -0.340147 -1.49567 1.477219
totalener: -311.12035115 hartree
nucrepener: 379.77163764 hartree
electener: -690.89198879 hartree
oneelecener: -1159.91677161 hartree
twoeener: 469.02478282 hartree
kineticenergy: 309.72165265 hartree
exchangeener: -12.750825656984 hartree
correlationener: -0.943347135263 hartree
xcener: -13.694172792247 hartree
chargesum: 1.0000000
charge: -0.265645 0.200713 -0.246934 0.202409 -0.150062 -0.126113 -0.240244 0.158159 0.176312 -0.264159 0.162296 0.180176 -0.251442 0.104129 0.166910 0.192787 0.153522 0.230463 0.205145 0.225187 0.186391
charge: 0.130475 0.013906 0.171577 0.009028 0.018650 0.072588 0.076662 -0.004746 -0.003508 0.105197 -0.012498 -0.001407 0.075650 0.311369 -0.016813 -0.000248 0.009395 0.017360 0.007503 0.039747 -0.019886
qa: -0.2656 0.2007 -0.2469 0.2024 -0.1501 -0.1261 -0.2402 0.1582 0.1763 -0.2642 0.1623 0.1802 -0.2514 0.1041 0.1669 0.1928 0.1535 0.2305 0.2051 0.2252 0.1864
va: 3.8888 0.9705 3.9150 0.9644 3.8273 3.8443 3.9092 0.9863 0.9761 3.8924 0.9836 0.9750 3.8846 3.5596 0.9823 0.9713 1.0110 0.9591 0.9705 0.9608 0.9817
energy: -311.824691816854
dipole: 0.13460 -1.04509 -0.91048 1.39094 -0.33298 1.05796 0.42216 -0.52820 -0.10604
magnitude: 1.39982 au
magnitude: 3.55806 debye
