program: Orca
programVersion: 5.0.3
elementType: C H C H C C C H H C H H C C H H H H H H H
charge: 1
multiplicity: 1
keywords: PBE0 def2-TZVP EnGrad RIJCOSX verytightscf def2/J soscf
formula: C8H13
InChI: InChI=1/C8H13/c1-2-4-6-8-7-5-3-1/h1-2,7H,3-6,8H2
21 atoms
C  -2.006224 0.702976 0.086356
H  -2.217102 0.879559 1.145186
C  -1.783597 -0.921329 -0.139956
H  -2.623277 -1.398814 0.368694
C  -0.434467 -1.342726 0.41143
C  0.699376 -1.281652 -0.361944
C  2.010642 -0.685414 0.076372
H  2.224915 -0.88206 1.131628
H  2.85837 -1.016187 -0.526708
C  1.806707 0.907654 -0.140371
H  1.868315 1.134444 -1.209727
H  2.623463 1.427153 0.363974
C  0.430919 1.292829 0.421012
C  -0.723008 1.312164 -0.360242
H  0.530657 -1.201484 -1.440365
H  -1.860895 -1.13037 -1.210853
H  0.025507 0.078042 0.444948
H  -0.570624 1.282806 -1.443537
H  -2.864091 1.002301 -0.517515
H  0.346588 1.501742 1.491691
H  -0.346028 -1.493214 1.489628
totalener: -312.01593569 hartree
nucrepener: 382.25825024 hartree
electener: -694.27418592 hartree
oneelecener: -1165.15472604 hartree
twoeener: 470.88054012 hartree
kineticenergy: 310.11602566 hartree
exchangeener: -34.160573503607 hartree
correlationener: -1.974753249040 hartree
xcener: -36.135326752647 hartree
chargesum: 1.0000000
charge: -0.217396 0.169320 -0.286524 0.185901 -0.070541 -0.047705 -0.216833 0.164029 0.178260 -0.292053 0.173637 0.182493 -0.041820 -0.015297 0.149326 0.177326 0.080529 0.162513 0.184398 0.196429 0.184006
charge: -0.198069 0.158734 -0.192285 0.161894 -0.173709 -0.075924 -0.208542 0.156650 0.158680 -0.199640 0.155523 0.159451 -0.173632 -0.028107 0.164770 0.156304 0.306259 0.168949 0.161530 0.174930 0.166234
qa: -0.2174 0.1693 -0.2865 0.1859 -0.0705 -0.0477 -0.2168 0.1640 0.1783 -0.2921 0.1736 0.1825 -0.0418 -0.0153 0.1493 0.1773 0.0805 0.1625 0.1844 0.1964 0.1840
va: 3.9035 0.9700 4.0193 0.9651 3.7601 3.9677 3.9096 0.9705 0.9674 4.0223 0.9645 0.9680 3.6988 3.9547 0.9664 0.9643 1.1065 0.9623 0.9652 0.9580 0.9620
energy: -312.015935687718
dipole: -0.00394 -0.14158 -0.14552 0.17263 0.05092 0.22355 0.08171 -0.10745 -0.02574
magnitude: 0.26798 au
magnitude: 0.68116 debye
