program: Gaussian 09
title: 000051057
version: EM64L-G09RevD.01
frameworkgroup: C1[X(C12H16N2)]
method: RPBEPBE
basis: SDD
operation: Freq
keyword: #pfreq=noraman
keyword: PBEPBE/SDD
title: #p freq=noraman PBEPBE/SDD
converged: YES YES NO NO
title: Mulliken charges:
elementType: N N C C C C C C C C C C C C H H H H H H H H H H H H H H H H
charge: -0.280553 -0.290763 0.267922 -0.545982 0.217100 0.452405 -0.563287 -0.367731 -0.223267 -0.832908 -0.401051 -0.244561 -0.220305 -0.624520 0.229359 0.219437 0.260749 0.223033 0.197632 0.250229 0.229621 0.234105 0.225047 0.240590 0.253858 0.221928 0.230849 0.222305 0.226547 0.192213
chargesum: 0.00000
title: Mulliken charges with hydrogens summed into heavy atoms:
elementType: N N C C C C C C C C C C C C
charge: -0.280553 -0.036905 0.267922 -0.097186 0.217100 0.452405 -0.302538 0.052934 0.026962 -0.144135 -0.160461 -0.022633 0.010545 0.016545
polarizability: 1.80769413e+02 -2.13421356e+01 1.75568135e+02 -1.40882280e+01 -5.47594325e+00 8.57611695e+01
1716.lowfreq: -45.9225 -9.5146 0.0002 0.0005 0.0006 2.6238 6.2416 34.1085 63.3778
frequency: -45.6131 33.9875 63.3303 77.2375 114.5800 128.8936 165.9272 215.4811 236.2402 253.2692 274.0101 298.9069 342.6163 412.1399 435.0678 492.7178 509.0429 571.8019 584.7813 644.4120 651.4000 670.2462 717.6727 730.3183 736.3089 781.4977 785.4150 825.0747 842.1659 913.4207 918.7359 956.5660 962.6698 980.3805 1008.5131 1012.6997 1039.4758 1054.0243 1097.5614 1113.2244 1133.7446 1136.2363 1160.1951 1162.6447 1185.3263 1209.7062 1258.1484 1275.3861 1291.7289 1315.2198 1345.5640 1357.8066 1367.2843 1398.1321 1435.0889 1439.0549 1446.0849 1451.2036 1465.9606 1470.2305 1473.2947 1485.5524 1489.4348 1498.2899 1524.4644 1528.5396 1548.3160 1637.9990 2860.8288 2875.8725 2969.8536 2972.6237 2998.2641 3013.2557 3032.1787 3042.6608 3074.0466 3082.8098 3145.2560 3159.8260 3172.5196 3191.5932 3212.4217 3442.0163
redmass: 1.0189 3.7124 3.8009 1.7164 2.5110 3.3878 3.2510 2.8944 1.2900 2.6067 2.7758 3.8702 4.3033 3.0736 2.9115 5.3308 2.9858 3.6689 5.0125 2.6950 3.3653 1.8300 2.9844 1.6955 2.2511 1.4453 1.4157 1.4909 2.9891 3.3710 1.3531 1.2924 2.0308 1.4467 2.4428 3.0763 1.4975 1.8795 1.9425 1.5652 1.7812 1.5366 1.4824 2.0286 1.6931 1.4373 1.5459 1.3922 1.3903 3.8923 1.9651 1.3616 2.4408 1.2560 1.1571 2.7637 2.1849 1.2618 1.0783 1.0910 1.1333 1.3858 1.0673 1.0680 5.6210 5.5682 5.9269 6.5003 1.0705 1.0570 1.0385 1.0599 1.0872 1.0755 1.1002 1.0976 1.0996 1.0972 1.0862 1.0902 1.0956 1.0998 1.0975 1.0744
irintensity: 0.2456 0.3394 0.0903 3.2006 1.9978 2.5009 0.6458 1.4965 2.3838 0.5648 0.6142 0.1281 1.6882 24.7785 0.9867 0.0463 1.7606 4.4722 7.8462 13.9212 19.3279 86.7215 0.8136 44.1400 26.2923 1.1170 56.9550 14.3185 2.9411 0.4023 1.5502 0.8854 4.4425 7.1204 5.4050 3.3518 7.4443 5.6570 6.0065 1.3258 36.0134 22.6512 8.5826 17.4835 0.7536 1.3140 2.0666 10.5787 2.9410 58.1169 7.0278 6.7738 19.9236 10.4715 2.3661 14.2720 5.4799 19.0500 12.2767 16.6007 7.1867 8.7137 18.6635 7.3507 0.8616 2.1543 12.4320 1.4348 61.5344 175.4457 43.8615 40.1307 14.5865 47.3233 35.8954 24.8274 42.7610 23.1662 0.5912 9.7190 19.0042 9.3636 2.9724 1.3843
temp: 298.150 k
press: 1.00000 atm
elementType: 7 7 6 6 6 6 6 6 6 6 6 6 6 6 1 1 1 1 1 1 1 1 1 1 1 1 1 1 1 1
symmnumber: 1
zpe: 666251.1 jmol-1
zpe.correction: 0.253762 hartree
zpe.thermalcorrener: 0.266876 hartree
zpe.thermalcorrenthalpy: 0.267820 hartree
zpe.thermalcorrgfe: 0.213442 hartree
zpe.sumelectzpe: -575.322091 hartree
zpe.sumelectthermal: -575.308978 hartree
zpe.sumelectthermalent: -575.308033 hartree
zpe.sumelectthermalfe: -575.362411 hartree
dipole: -1.4730 0.3047 -0.3054
dipole: 1.5349
quadrupole: -75.4842 -78.5591 -88.8304
quadrupole: -3.8438 -1.1756 0.2609
quadrupole: 5.4737 2.3988 -7.8725 -3.8438 -1.1756 0.2609
hfenergy: -575.5758531 hartree
pointgroup: C01 [X(C12H16N2)]
dipole: 0.5862 -0.0866607 -0.1162858 debye
polarizability: 183.670086|-20.0160986|173.1410878|14.682958|1.682542|85.287544 unknown
InChI: InChI=1S/C12H16N2/c1-10-9-11-5-3-4-8-14(11)12(10)6-7-13-2/h3-5,8-9,13H,6-7H2,1-2H3
charge 0 multiplicity 1
30 atoms
N  -0.775221 0.176898 0.194069
N  3.777503 0.909978 0.184779
C  0.29742 -0.70193 0.394521
C  1.654944 -0.221711 0.822341
C  -0.160604 -2.008353 0.092514
C  -1.930015 -0.573899 -0.234445
C  -1.533397 -1.928433 -0.293749
C  2.508218 0.365356 -0.3351
C  -0.835965 1.559719 0.3618
C  0.672822 -3.264093 0.180741
C  -3.139096 0.13623 -0.482894
C  -2.022494 2.234681 0.118109
C  -3.19534 1.521518 -0.31238
C  4.639695 1.541754 -0.83125
H  1.583987 0.551087 1.614167
H  2.201931 -1.073147 1.272081
H  -2.173599 -2.760489 -0.58259
H  1.955803 1.191916 -0.824194
H  2.649472 -0.423463 -1.116682
H  0.078908 2.057285 0.690596
H  1.011246 -3.460743 1.216433
H  0.092794 -4.142547 -0.14951
H  1.577676 -3.205213 -0.453725
H  -4.016957 -0.430878 -0.807538
H  4.286692 0.210044 0.741429
H  -2.04846 3.318857 0.25764
H  -4.12402 2.067389 -0.503665
H  5.574819 1.893811 -0.360479
H  4.126014 2.426416 -1.25176
H  4.910622 0.875562 -1.687159
