program: Orca
programVersion: 5.0.3
elementType: C H C H C C C H H C H H C C H H H H H H H
charge: 1
multiplicity: 1
keywords: DSD-PBEP86 def2-TZVP RIJCOSX verytightscf def2-TZVP/C def2/J soscf noTRAH
formula: C8H13
InChI: InChI=1/C8H13/c1-2-4-6-8-7-5-3-1/h1-2,7H,3-6,8H2
21 atoms
C  -1.990473 0.580972 0.092471
H  -2.167575 0.758415 1.159111
C  -1.840673 -0.962929 -0.173537
H  -2.654605 -1.500568 0.320914
C  -0.448346 -1.293938 0.344484
C  0.645798 -1.229742 -0.446631
C  1.939218 -0.693279 0.072625
H  2.098138 -0.944513 1.126462
H  2.807627 -1.036108 -0.499825
C  1.829332 0.856911 -0.095351
H  1.876717 1.117601 -1.159066
H  2.667749 1.358943 0.395831
C  0.492909 1.43115 0.511284
C  -0.670998 1.140116 -0.318167
H  0.526943 -1.277188 -1.53067
H  -1.902919 -1.159307 -1.24881
H  0.348228 1.128992 1.551464
H  -0.568029 1.405103 -1.375342
H  -2.811613 1.002959 -0.497033
H  0.622349 2.532147 0.484803
H  -0.322317 -1.314911 1.428215
totalener: -311.15740183 hartree
nucrepener: 380.60463729 hartree
electener: -691.76203912 hartree
oneelecener: -1161.61673758 hartree
twoeener: 469.85469845 hartree
kineticenergy: 309.99714484 hartree
exchangeener: -12.756896203326 hartree
correlationener: -0.943926514668 hartree
xcener: -13.700822717994 hartree
chargesum: 1.0000000
charge: -0.206469 0.175017 -0.210959 0.177459 -0.159368 -0.144347 -0.217233 0.156827 0.167300 -0.246877 0.151841 0.174685 -0.172515 0.095458 0.165689 0.166250 0.163025 0.212402 0.182753 0.202885 0.166176
charge: -0.194524 0.161985 -0.192385 0.151002 -0.110821 -0.129845 -0.219757 0.150506 0.153775 -0.195877 0.144648 0.150455 -0.213401 0.195567 0.154448 0.152751 0.158169 0.175007 0.160867 0.193679 0.153750
qa: -0.2065 0.1750 -0.2110 0.1775 -0.1594 -0.1443 -0.2172 0.1568 0.1673 -0.2469 0.1518 0.1747 -0.1725 0.0955 0.1657 0.1662 0.1630 0.2124 0.1828 0.2029 0.1662
va: 3.8409 0.9670 3.8550 0.9686 3.8709 3.8516 3.8933 0.9720 0.9712 3.8738 0.9706 0.9630 3.8616 3.5114 0.9637 0.9722 0.9761 0.9391 0.9679 0.9562 0.9641
total: -311.837483441 hartree
energy: -311.837483440612
dipole: 0.48788 -1.03237 -0.54449 1.93932 -0.77983 1.15949 0.14604 -0.32392 -0.17788
magnitude: 1.29326 au
magnitude: 3.28721 debye
