program: Orca
programVersion: 5.0.3
elementType: C H C H C C C H H C H H C C H H H H H H H
charge: 1
multiplicity: 1
keywords: b3lyp def2-TZVP EnGrad RIJCOSX verytightscf def2/J soscf
formula: C8H13
InChI: InChI=1/C8H13/c1-2-4-6-8-7-5-3-1/h1-2,7H,3-6,8H2
21 atoms
C  -1.998767 0.525524 0.118465
H  -2.178536 0.72308 1.178676
C  -1.969336 -1.00203 -0.167266
H  -2.677316 -1.597734 0.410584
C  -0.526339 -1.118052 0.277344
C  0.605474 -1.108227 -0.508868
C  1.905639 -0.645901 0.061507
H  2.001664 -0.953406 1.108222
H  2.755885 -1.045709 -0.497441
C  1.905503 0.920209 -0.02838
H  2.04572 1.219935 -1.073456
H  2.749065 1.323242 0.538101
C  0.562716 1.480067 0.486259
C  -0.534508 0.785526 -0.25628
H  0.526942 -1.293588 -1.579635
H  -2.091709 -1.218247 -1.232496
H  0.44942 1.372167 1.570025
H  -0.415347 0.853643 -1.340697
H  -2.701321 1.107428 -0.485736
H  0.5067 2.555129 0.255659
H  -0.374313 -1.068002 1.35661
totalener: -312.25454082 hartree
nucrepener: 386.18376086 hartree
electener: -698.43830168 hartree
oneelecener: -1173.24442687 hartree
twoeener: 474.80612519 hartree
kineticenergy: 310.56151752 hartree
exchangeener: -36.348604366539 hartree
correlationener: -2.309353661707 hartree
xcener: -38.657958028246 hartree
chargesum: 1.0000000
charge: -0.178751 0.152578 -0.181508 0.166782 -0.042811 -0.031100 -0.206196 0.150633 0.165264 -0.220187 0.145001 0.162487 -0.169648 -0.053713 0.190779 0.147682 0.139278 0.165224 0.164551 0.170374 0.163281
charge: -0.190078 0.154682 -0.184247 0.151924 -0.059202 -0.021613 -0.203791 0.157441 0.161030 -0.206679 0.149350 0.153709 -0.222546 0.009687 0.166082 0.154097 0.153280 0.172516 0.153448 0.177401 0.173510
qa: -0.1788 0.1526 -0.1815 0.1668 -0.0428 -0.0311 -0.2062 0.1506 0.1653 -0.2202 0.1450 0.1625 -0.1696 -0.0537 0.1908 0.1477 0.1393 0.1652 0.1646 0.1704 0.1633
va: 3.8602 0.9738 3.8570 0.9718 3.8072 3.7569 3.8854 0.9669 0.9691 3.8598 0.9684 0.9669 3.8852 3.7268 0.9511 0.9733 0.9736 0.9607 0.9701 0.9649 0.9649
energy: -312.254540821532
dipole: 0.55932 -0.69145 -0.13213 1.85148 -1.80619 0.04529 0.19517 -0.35221 -0.15705
magnitude: 0.21018 au
magnitude: 0.53423 debye
