program: Orca
programVersion: 5.0.3
charge: 1
multiplicity: 1
keywords: DLPNO-CCSD(T1) tightPNO Extrapolate(3/4,def2) RIJK def2/JK verytightSCF miniprint nopop
formula: C8H13
InChI: InChI=1/C8H13/c1-2-4-6-8-7-5-3-1/h1-2,7H,3-6,8H2
21 atoms
C  -1.993364 0.544295 0.11595
H  -2.16891 0.731401 1.179259
C  -1.91285 -0.984281 -0.174262
H  -2.670836 -1.561006 0.36022
C  -0.491616 -1.205729 0.302914
C  0.622737 -1.167606 -0.486046
C  1.914544 -0.668263 0.070294
H  2.033223 -0.950217 1.121885
H  2.779304 -1.040974 -0.4865
C  1.866057 0.89177 -0.057631
H  1.954899 1.169473 -1.114767
H  2.717729 1.339591 0.461787
C  0.537641 1.475909 0.502413
C  -0.592617 0.949495 -0.288325
H  0.533474 -1.308951 -1.563041
H  -2.005721 -1.183198 -1.24649
H  0.409759 1.297265 1.574322
H  -0.457272 1.036788 -1.369719
H  -2.757275 1.063004 -0.474204
H  0.574474 2.569972 0.351234
H  -0.347793 -1.167021 1.384334
e0: -310.317484405 hartree
corrType: DLPNO BASED
e0: -310.331097332 hartree
basis: def2-TZVPP def2-QZVPP
scfener: -310.317484405 -310.331097332
corrmethod: MDCI MDCI
correner: -1.449894964 -1.520139903
corrcbsextra: -1.572173152
energy: -311.905145510518
dipole: 0.55763 -0.95195 -0.39432 1.86855 -1.29272 0.57582 0.16693 -0.35908 -0.19214
magnitude: 0.72386 au
magnitude: 1.83992 debye
