program: Orca
programVersion: 5.0.3
elementType: C H C H C C C H H C H H C C H H H H H H H
charge: 1
multiplicity: 1
keywords: DSD-PBEP86 cc-pVTZ EnGrad RIJCOSX verytightscf cc-pVTZ/C def2/J soscf
formula: C8H13
InChI: InChI=1/C8H13/c1-2-4-6-8-7-5-3-1/h1-2,7H,3-6,8H2
21 atoms
C  -1.993731 0.542917 0.116685
H  -2.169328 0.730384 1.17987
C  -1.916595 -0.98534 -0.174085
H  -2.671379 -1.563779 0.36289
C  -0.4939 -1.200301 0.300882
C  0.621676 -1.163929 -0.487783
C  1.913745 -0.666894 0.069986
H  2.030603 -0.950456 1.12135
H  2.777913 -1.041283 -0.486484
C  1.868352 0.893629 -0.055685
H  1.960081 1.172481 -1.112266
H  2.72004 1.338571 0.46612
C  0.539552 1.477009 0.501445
C  -0.588693 0.938691 -0.286293
H  0.533556 -1.30894 -1.564343
H  -2.011356 -1.184745 -1.24602
H  0.412613 1.303903 1.574436
H  -0.453185 1.020859 -1.367982
H  -2.754035 1.066339 -0.473836
H  0.570449 2.570174 0.344334
H  -0.349433 -1.159668 1.38213
totalener: -311.16925356 hartree
nucrepener: 383.52363496 hartree
electener: -694.69288853 hartree
oneelecener: -1167.33430082 hartree
twoeener: 472.64141230 hartree
kineticenergy: 309.72746604 hartree
exchangeener: -12.756909219487 hartree
correlationener: -0.946116891629 hartree
xcener: -13.703026111116 hartree
chargesum: 1.0000000
charge: -0.228608 0.173104 -0.232051 0.184822 -0.085685 -0.106678 -0.250020 0.165872 0.183622 -0.251072 0.159476 0.184140 -0.237294 -0.023185 0.221412 0.168057 0.170773 0.215143 0.185760 0.204949 0.197462
charge: 0.088563 0.001821 0.092981 -0.000117 0.124579 0.128174 0.075854 0.000541 0.006526 0.098943 -0.005989 0.000055 0.063993 0.281212 -0.004009 0.000620 0.001417 0.006121 0.005397 0.031518 0.001799
qa: -0.2286 0.1731 -0.2321 0.1848 -0.0857 -0.1067 -0.2500 0.1659 0.1836 -0.2511 0.1595 0.1841 -0.2373 -0.0232 0.2214 0.1681 0.1708 0.2151 0.1858 0.2049 0.1975
va: 3.8670 0.9833 3.8891 0.9754 3.8160 3.8187 3.9201 0.9840 0.9760 3.8899 0.9815 0.9714 3.9059 3.6795 0.9625 0.9860 0.9823 0.9673 0.9744 0.9655 0.9772
energy: -311.872030677462
dipole: 0.55903 -0.81279 -0.25376 1.86640 -1.49381 0.37259 0.16869 -0.30564 -0.13695
magnitude: 0.47114 au
magnitude: 1.19755 debye
