program: Orca
programVersion: 5.0.3
elementType: C H C H C C C H H C H H C C H H H H H H H
charge: 1
multiplicity: 1
keywords: b3lyp def2-TZVP EnGrad RIJCOSX verytightscf def2/J soscf
formula: C8H13
InChI: InChI=1/C8H13/c1-2-4-6-8-7-5-3-1/h1-2,7H,3-6,8H2
21 atoms
C  -2.006375 0.699815 0.08746
H  -2.217545 0.879321 1.145779
C  -1.787328 -0.920857 -0.139262
H  -2.624482 -1.403711 0.368318
C  -0.435591 -1.340923 0.411086
C  0.699242 -1.280851 -0.361787
C  2.010609 -0.684848 0.077488
H  2.224837 -0.882277 1.132524
H  2.857958 -1.015465 -0.526119
C  1.807659 0.909266 -0.139666
H  1.870185 1.134959 -1.209166
H  2.624647 1.427527 0.365556
C  0.432316 1.295925 0.418816
C  -0.719933 1.310124 -0.359054
H  0.530952 -1.201744 -1.440308
H  -1.863073 -1.130609 -1.210307
H  0.02032 0.063287 0.405401
H  -0.567164 1.279301 -1.442172
H  -2.863282 1.003523 -0.515702
H  0.344959 1.477213 1.494075
H  -0.345556 -1.485334 1.490013
totalener: -312.18452023 hartree
nucrepener: 382.37027704 hartree
electener: -694.55479727 hartree
oneelecener: -1165.38421734 hartree
twoeener: 470.82942007 hartree
kineticenergy: 310.49145981 hartree
exchangeener: -36.314098842088 hartree
correlationener: -2.308386651866 hartree
xcener: -38.622485493954 hartree
chargesum: 1.0000000
charge: -0.206927 0.157100 -0.260830 0.173476 -0.083826 -0.022264 -0.205917 0.152385 0.167887 -0.266257 0.161773 0.171197 -0.065156 0.002304 0.143067 0.164723 0.124291 0.155610 0.172309 0.187737 0.177322
charge: -0.192033 0.154576 -0.187365 0.158085 -0.164021 -0.071152 -0.200424 0.152887 0.155629 -0.192965 0.151856 0.156103 -0.164146 -0.032906 0.161740 0.152477 0.305615 0.165284 0.157905 0.169898 0.162957
qa: -0.2069 0.1571 -0.2608 0.1735 -0.0838 -0.0223 -0.2059 0.1524 0.1679 -0.2663 0.1618 0.1712 -0.0652 0.0023 0.1431 0.1647 0.1243 0.1556 0.1723 0.1877 0.1773
va: 3.8446 0.9693 3.9315 0.9671 3.6877 3.8474 3.8504 0.9697 0.9672 3.9352 0.9648 0.9692 3.6444 3.8380 0.9658 0.9647 1.0270 0.9621 0.9659 0.9579 0.9613
energy: -312.184520232654
dipole: -0.00678 -0.10901 -0.11579 0.13710 0.04297 0.18006 0.05439 -0.07792 -0.02352
magnitude: 0.21537 au
magnitude: 0.54742 debye
