program: Gaussian 09
title: 000051102
version: EM64L-G09RevD.01
frameworkgroup: C1[X(C15H19N5O)]
method: RPBEPBE
basis: SDD
operation: Freq
keyword: #p
keyword: freq=noraman
keyword: PBEPBE/SDD
title: #p freq=noraman PBEPBE/SDD
converged: YES YES NO NO
title: Mulliken charges:
elementType: O N N N N N C C C C C C C C C C C C C C C H H H H H H H H H H H H H H H H H H H
charge: -0.229544 -0.347166 -0.311504 -0.087542 -0.105304 -0.038983 -0.343919 -0.379933 -0.352096 -0.537927 -0.700972 0.229594 0.334374 0.170555 0.034762 -0.360256 -0.347859 -0.386222 -0.233277 -0.212804 -0.243550 0.197322 0.220262 0.209695 0.195596 0.186876 0.197685 0.221565 0.242790 0.216056 0.208844 0.225650 0.326212 0.348751 0.229302 0.275089 0.249406 0.232925 0.230697 0.234849
chargesum: 0.00000
title: Mulliken charges with hydrogens summed into heavy atoms:
elementType: O N N N N N C C C C C C C C C C C C C C C
charge: -0.229544 -0.020954 0.037247 -0.087542 -0.105304 -0.038983 0.073665 0.025358 0.032465 -0.073571 -0.050422 0.229594 0.334374 0.170555 0.034762 -0.130954 -0.072769 -0.136816 -0.000352 0.017892 -0.008701
polarizability: 2.54257064e+02 2.33694166e+01 2.41341540e+02 8.57107808e+00 -1.60166461e+01 1.23343409e+02
1716.lowfreq: -12.9217 -10.3954 -8.0484 -0.0006 -0.0005 0.0004 5.3195 14.7359 21.7042
frequency: -9.2577 13.4493 21.3252 46.7965 49.0364 63.1743 91.0224 91.6887 102.1040 119.0448 132.5707 166.3540 190.5993 226.6289 230.5382 242.0994 297.6641 312.9103 348.3695 383.0443 395.5347 402.2197 414.5379 442.3995 458.7977 476.1785 499.9677 566.8131 605.0857 618.0464 627.6934 659.2620 672.8277 683.8866 696.0772 723.6889 732.7819 768.5128 791.0020 794.6818 841.3996 853.4437 869.0152 887.5127 905.3208 910.6707 931.3554 940.1595 959.4891 987.6140 990.2402 995.6951 1006.1959 1024.2421 1027.8455 1056.5863 1066.5702 1081.3267 1089.5434 1098.2889 1105.8246 1119.3384 1169.4276 1175.1731 1190.9739 1211.1271 1212.0447 1252.9104 1272.0323 1281.1208 1291.4027 1295.0573 1307.7036 1316.0143 1318.2025 1337.6668 1361.1418 1383.0139 1390.1418 1412.9714 1441.7002 1451.2741 1457.5258 1462.0094 1465.8457 1467.8755 1475.2113 1477.8173 1480.6003 1488.5636 1496.6165 1521.0485 1587.2881 1612.3633 1642.2471 2955.7722 2962.3867 2973.7461 2975.2578 2993.8754 2997.6554 3013.2843 3042.2029 3069.7654 3072.2043 3080.5620 3130.4598 3139.8454 3151.6327 3164.6331 3174.6123 3185.3585 3525.8104 3535.6350
redmass: 5.2346 4.8945 3.6735 5.3283 4.2169 4.0721 4.5827 2.0292 3.1403 3.1755 4.9545 2.5382 3.3351 3.3801 1.3483 4.3839 4.2611 7.0630 3.1876 2.8648 3.6226 2.8231 4.4681 3.0039 1.7970 4.3862 3.2723 1.5257 5.0494 6.3689 5.2641 4.5496 5.6879 2.1740 1.6812 5.1798 1.1916 3.4921 1.9937 1.4886 1.8348 1.3264 1.5256 3.4769 7.2571 1.9303 1.5115 1.4386 7.9904 1.5238 4.4248 2.6552 1.3382 2.0906 1.9798 2.9054 3.7065 1.9756 2.1438 2.5144 2.0104 6.3435 2.1934 1.0607 1.1329 2.0162 1.4161 2.5673 1.3491 1.3720 1.0671 2.0952 1.8426 1.3204 1.4533 1.4459 1.5750 6.0951 1.2154 4.0526 1.9510 1.4725 2.4057 1.0937 1.2338 1.1087 1.0496 1.0736 2.4290 1.0937 3.2786 3.7998 6.1082 6.0212 7.6302 1.0600 1.0602 1.0416 1.0543 1.0689 1.0940 1.0993 1.1042 1.0996 1.1003 1.0984 1.0851 1.0885 1.0936 1.0970 1.0979 1.0922 1.0796 1.0767
irintensity: 2.5413 1.9705 0.5287 1.3765 0.0953 5.6476 0.1389 1.1004 0.3617 0.9892 4.2521 0.8727 1.5865 0.2613 0.0247 0.8077 10.8877 0.3862 0.6243 0.7576 6.5390 0.1675 4.7855 5.6290 15.6726 20.9824 17.3520 161.3789 21.2747 2.7111 24.1439 3.6553 10.7500 8.0960 48.4434 5.0746 12.2688 32.1157 28.2648 0.2283 1.5195 2.8074 13.4671 5.2189 11.2696 7.6079 15.2558 1.9649 12.6396 2.2334 0.1606 1.4229 1.1900 32.6911 11.5462 6.9707 47.3937 3.9918 11.6292 15.7896 1.6014 48.7653 18.1523 0.7669 9.3510 3.1744 7.2809 84.2719 14.8802 10.8069 0.7048 37.4423 9.1656 1.9259 5.9414 1.9357 1.4369 5.4179 12.4360 11.8828 42.6247 65.0893 52.0564 2.2403 48.0193 9.0574 14.5294 9.1037 174.6425 16.1559 294.6277 233.0783 0.0557 7.5040 152.0680 16.0527 13.4916 22.4606 65.0495 24.7782 21.4288 4.2929 86.0326 47.4994 90.0012 27.9786 0.6230 6.1471 24.8792 20.9916 11.4709 5.9152 21.2639 86.3359
temp: 298.150 k
press: 1.00000 atm
elementType: 8 7 7 7 7 7 6 6 6 6 6 6 6 6 6 6 6 6 6 6 6 1 1 1 1 1 1 1 1 1 1 1 1 1 1 1 1 1 1 1
symmnumber: 1
zpe: 847894.6 jmol-1
zpe.correction: 0.322946 hartree
zpe.thermalcorrener: 0.342590 hartree
zpe.thermalcorrenthalpy: 0.343535 hartree
zpe.thermalcorrgfe: 0.272011 hartree
zpe.sumelectzpe: -930.384945 hartree
zpe.sumelectthermal: -930.365301 hartree
zpe.sumelectthermalent: -930.364356 hartree
zpe.sumelectthermalfe: -930.435880 hartree
dipole: 0.8851 4.8814 -4.0069
dipole: 6.3770
quadrupole: -105.3152 -135.7382 -129.6338
quadrupole: 1.2536 11.7420 5.7240
quadrupole: 18.2472 -12.1758 -6.0714 1.2536 11.7420 5.7240
hfenergy: -930.7078909 hartree
pointgroup: C01 [X(C15H19N5O1)]
dipole: 0.7664734 -1.83897 1.5249231 debye
polarizability: 261.7356012|-19.9099996|233.55451|-11.3362937|-15.254109|123.6519008 unknown
InChI: InChI=1S/C15H19N5O/c1-2-3-5-10-14(21)18-20-15-17-13(11-16-19-15)12-8-6-4-7-9-12/h4,6-9,11,18,20H,2-3,5,10H2,1H3
charge 0 multiplicity 1
40 atoms
O  -3.467348 0.286705 -1.193218
N  -2.760166 0.792905 0.968769
N  -2.278021 2.05345 0.630931
N  -0.048895 1.283744 0.311145
N  -0.775012 3.567057 -0.280397
N  0.480068 3.865423 -0.721484
C  -1.737306 -2.737043 -0.405399
C  -2.551744 -2.376802 0.856844
C  -0.642304 -3.791657 -0.125572
C  -3.746579 -1.421598 0.576362
C  0.191147 -4.13736 -1.378483
C  -3.3210 -0.066357 0.007238
C  2.265544 0.563526 -0.014422
C  1.212725 1.602994 -0.123494
C  -0.981018 2.271543 0.194272
C  3.646182 0.88406 -0.135782
C  1.891384 -0.788646 0.213813
C  1.453164 2.901604 -0.660733
C  4.625374 -0.125917 -0.036486
C  2.870751 -1.797103 0.306569
C  4.242091 -1.470213 0.181603
H  -2.424145 -3.121059 -1.187077
H  -1.27595 -1.821746 -0.827181
H  -2.957618 -3.305002 1.306833
H  -1.876353 -1.930533 1.615897
H  0.027982 -3.421046 0.678625
H  -1.116082 -4.712775 0.271528
H  -4.327518 -1.269644 1.507368
H  -4.419367 -1.878151 -0.16951
H  -0.454329 -4.532894 -2.184833
H  0.959452 -4.90149 -1.157581
H  0.706235 -3.241393 -1.772244
H  -2.565889 0.465146 1.917339
H  -2.957688 2.785439 0.408941
H  3.964638 1.920996 -0.286156
H  0.827014 -1.021372 0.310438
H  2.418483 3.207845 -1.066674
H  5.685585 0.134528 -0.124581
H  2.567766 -2.836903 0.471547
H  5.004247 -2.253858 0.254243
