program: Orca
programVersion: 5.0.3
elementType: C H C H C C C H H C H H C C H H H H H H H
charge: 1
multiplicity: 1
keywords: DSD-PBEP86/2013 def2-TZVP D3BJ RIJCOSX verytightscf def2-TZVP/C def2/J soscf noTRAH
formula: C8H13
InChI: InChI=1/C8H13/c1-2-4-6-8-7-5-3-1/h1-2,7H,3-6,8H2
21 atoms
C  -2.00569 0.708869 0.084303
H  -2.216339 0.879682 1.144025
C  -1.777025 -0.922827 -0.140966
H  -2.621346 -1.388964 0.370877
C  -0.4327 -1.346481 0.411233
C  0.699271 -1.28315 -0.362555
C  2.010372 -0.686021 0.074382
H  2.224813 -0.881369 1.130032
H  2.858828 -1.017407 -0.527564
C  1.805244 0.90479 -0.141631
H  1.865704 1.133904 -1.210621
H  2.621396 1.426603 0.361394
C  0.428886 1.287065 0.425601
C  -0.728748 1.315098 -0.362575
H  0.5308 -1.203934 -1.441154
H  -1.858269 -1.130196 -1.211495
H  0.037386 0.109843 0.524836
H  -0.578028 1.292604 -1.446379
H  -2.865018 0.999397 -0.521566
H  0.351175 1.553204 1.484301
H  -0.346467 -1.503582 1.488667
totalener: -311.08893886 hartree
nucrepener: 382.01747922 hartree
electener: -693.10641809 hartree
oneelecener: -1164.10589047 hartree
twoeener: 470.99947239 hartree
kineticenergy: 309.95042720 hartree
exchangeener: -14.116713723598 hartree
correlationener: -0.948171932030 hartree
xcener: -15.064885655628 hartree
chargesum: 1.0000000
charge: -0.213833 0.169754 -0.286117 0.185703 -0.088697 -0.067992 -0.204569 0.160649 0.175404 -0.303324 0.169914 0.180371 -0.044250 0.003385 0.150451 0.174900 0.073947 0.176321 0.185527 0.211731 0.190726
charge: -0.187867 0.154269 -0.181424 0.155762 -0.184513 -0.071313 -0.202004 0.150442 0.151755 -0.193759 0.147880 0.152506 -0.182913 0.026754 0.158628 0.149989 0.298320 0.167860 0.156376 0.173102 0.160149
qa: -0.2138 0.1698 -0.2861 0.1857 -0.0887 -0.0680 -0.2046 0.1606 0.1754 -0.3033 0.1699 0.1804 -0.0442 0.0034 0.1505 0.1749 0.0739 0.1763 0.1855 0.2117 0.1907
va: 3.8420 0.9716 3.9701 0.9646 3.6726 3.9133 3.8489 0.9724 0.9684 3.9761 0.9644 0.9695 3.5792 3.8481 0.9670 0.9648 1.1035 0.9580 0.9649 0.9547 0.9621
total: -311.755355975 hartree
dispcorr: -0.014440167 hartree
energy: -311.769796141410
dipole: 0.00435 -0.26683 -0.26248 0.25313 0.16519 0.41832 0.13638 -0.21174 -0.07536
magnitude: 0.49957 au
magnitude: 1.26979 debye
