program: Gaussian 09
title: 000051069
version: EM64L-G09RevD.01
frameworkgroup: C1[X(C12H20N2)]
method: RPBEPBE
basis: SDD
operation: Freq
keyword: #pfreq=noraman
keyword: PBEPBE/SDD
title: #p freq=noraman PBEPBE/SDD
converged: YES YES NO NO
title: Mulliken charges:
elementType: N N C C C C C C C C C C C C H H H H H H H H H H H H H H H H H H H H
charge: -0.257103 -0.286793 0.439939 -0.387793 -0.533400 -0.411899 -0.423312 0.229941 0.194550 -0.582338 -0.544635 -0.359859 -0.824166 -0.624340 0.217391 0.221426 0.226213 0.208111 0.208111 0.209699 0.206294 0.217681 0.253327 0.241747 0.201170 0.227532 0.179642 0.226235 0.223287 0.217604 0.249369 0.227734 0.188024 0.220610
chargesum: 0.00000
title: Mulliken charges with hydrogens summed into heavy atoms:
elementType: N N C C C C C C C C C C C C
charge: -0.257103 -0.037424 0.439939 0.051024 -0.099076 0.005912 0.000663 0.229941 0.194550 -0.329011 -0.101718 0.047316 -0.157040 0.012027
polarizability: 1.69560234e+02 2.24284347e+00 1.51427431e+02 7.75784353e+00 -5.53050085e+00 1.02558502e+02
1716.lowfreq: -8.0762 0.0007 0.0008 0.0008 10.2022 13.9763 38.2914 59.2365 68.2386
frequency: 38.1381 59.1949 68.2284 81.7685 87.5745 115.3917 137.6403 195.7351 207.7879 231.6120 243.6432 283.3375 296.7652 313.0488 343.7564 409.5149 423.7548 452.1243 512.7439 578.6498 620.2111 638.6389 643.0795 685.0705 727.4588 775.7950 795.0699 818.3117 829.8304 874.4755 921.8223 943.9401 963.0537 972.2067 980.0230 1018.8633 1036.4481 1043.3075 1087.8464 1091.8653 1098.5251 1118.6848 1141.3911 1148.0622 1161.2528 1167.8390 1169.9221 1205.4698 1215.0391 1250.5185 1263.2497 1273.5564 1291.1888 1315.0054 1333.7146 1342.4657 1348.7513 1356.9878 1364.8394 1399.9235 1418.8118 1430.4138 1436.4466 1447.5349 1461.9840 1463.7921 1465.9190 1469.4467 1470.7869 1473.2171 1480.5525 1486.3442 1493.4284 1497.6180 1527.4195 1592.0043 2839.1327 2866.8165 2946.6218 2950.3455 2956.0773 2963.5217 2981.9040 2986.9067 3011.2117 3012.5483 3029.5008 3031.6261 3036.1771 3047.2878 3050.4705 3056.1185 3067.5785 3072.5689 3195.2736 3443.1499
redmass: 3.2316 2.7742 1.0836 1.7819 2.6553 2.4441 2.7849 2.4692 2.4202 2.1252 1.7146 2.3591 2.9462 1.9028 3.7556 3.1785 3.7834 2.4869 2.6861 3.7619 2.9121 3.3810 1.5834 2.8969 2.6290 1.6281 1.3153 2.2791 1.4786 2.2637 1.4268 2.3768 2.0046 2.1163 1.4626 3.2082 1.6788 1.6755 1.5954 1.5574 1.6018 1.8464 2.1751 1.4053 2.6858 1.4384 1.6457 3.3776 1.4758 1.2638 1.2218 1.1735 1.4241 1.5411 1.4551 1.5819 1.5404 1.5693 2.3957 1.2748 2.8498 3.5881 1.1611 1.2498 1.1015 1.0792 1.0743 1.1092 1.0623 1.0886 1.1405 1.0880 1.1159 1.0925 6.6196 6.3614 1.0712 1.0570 1.0688 1.0663 1.0680 1.0382 1.0629 1.0619 1.0781 1.0810 1.0931 1.0926 1.0964 1.0989 1.0934 1.1043 1.0978 1.0997 1.0974 1.0743
irintensity: 0.1387 0.0775 0.0906 1.6516 1.6983 2.6837 0.4118 5.3815 1.5269 2.2555 1.4407 0.3623 2.8680 1.1030 0.1225 10.8869 7.6997 1.4545 3.9284 1.6029 5.2797 12.7032 82.4790 18.7333 4.7002 0.5955 28.3789 2.5736 6.8910 3.0023 1.0606 3.2229 6.0429 1.5049 0.9441 2.3613 10.2005 4.5355 2.1466 5.9086 5.8206 8.4479 13.6564 7.7457 29.1112 5.3778 4.8928 8.9208 2.7485 12.3219 8.0813 3.6666 0.6839 5.8455 16.3385 3.8839 1.8882 18.2948 24.5613 12.6138 13.5807 17.6614 2.8328 24.5561 4.3669 8.9976 8.1797 13.2660 14.4924 4.0606 13.8146 11.5993 7.5598 3.8247 8.8354 3.1536 101.3233 168.0015 60.4671 17.9887 72.7857 59.3568 36.9137 24.5222 60.8845 21.3585 65.1058 7.3366 29.6160 64.7142 30.0269 60.3707 30.3561 41.3485 7.5765 1.8957
temp: 298.150 k
press: 1.00000 atm
elementType: 7 7 6 6 6 6 6 6 6 6 6 6 6 6 1 1 1 1 1 1 1 1 1 1 1 1 1 1 1 1 1 1 1 1
symmnumber: 1
zpe: 787589.4 jmol-1
zpe.correction: 0.299977 hartree
zpe.thermalcorrener: 0.314947 hartree
zpe.thermalcorrenthalpy: 0.315891 hartree
zpe.thermalcorrgfe: 0.257337 hartree
zpe.sumelectzpe: -577.671419 hartree
zpe.sumelectthermal: -577.656449 hartree
zpe.sumelectthermalent: -577.655505 hartree
zpe.sumelectthermalfe: -577.714059 hartree
dipole: -0.6249 -3.0143 -0.0079
dipole: 3.0784
quadrupole: -83.5078 -81.7759 -87.1526
quadrupole: -0.9407 -0.6008 -2.4877
quadrupole: 0.6376 2.3695 -3.0072 -0.9407 -0.6008 -2.4877
hfenergy: -577.9713961 hartree
pointgroup: C01 [X(C12H20N2)]
dipole: 0.2564062 1.1836792 0.0015206 debye
polarizability: 169.6514485|2.0853949|151.3533095|-7.4685917|5.7598475|102.5414095 unknown
InChI: InChI=1S/C12H20N2/c1-10-9-11-5-3-4-8-14(11)12(10)6-7-13-2/h9,13H,3-8H2,1-2H3
charge 0 multiplicity 1
34 atoms
N  0.822531 0.205408 0.157015
N  -3.82588 0.876114 0.233474
C  1.912148 -0.560335 -0.287902
C  0.906412 1.627353 0.541217
C  3.237989 0.08291 -0.617684
C  2.134381 2.30269 -0.104177
C  3.404614 1.445481 0.100452
C  -0.291298 -0.635834 0.367667
C  0.095363 -1.945064 0.026905
C  1.478575 -1.887917 -0.379975
C  -1.62201 -0.113411 0.840849
C  -2.522463 0.433018 -0.298093
C  -0.776163 -3.177612 0.060855
C  -4.77713 1.360534 -0.782844
H  0.980713 1.708434 1.646429
H  -0.021835 2.142925 0.232551
H  4.061382 -0.603619 -0.347155
H  3.319799 0.252052 -1.712859
H  2.258414 3.307351 0.341581
H  1.958019 2.440453 -1.189253
H  3.569143 1.285414 1.184943
H  4.293015 1.974003 -0.29206
H  2.088526 -2.729173 -0.709972
H  -2.178345 -0.924637 1.343776
H  -1.485333 0.682721 1.603711
H  -2.702592 -0.377746 -1.030222
H  -1.975843 1.240758 -0.852127
H  -1.051404 -3.517268 -0.957203
H  -0.258635 -4.022182 0.553636
H  -1.717739 -2.997402 0.610266
H  -3.711629 1.543637 1.008181
H  -5.032149 0.53331 -1.47135
H  -4.397463 2.207551 -1.407249
H  -5.712813 1.686385 -0.294283
