program: Orca
programVersion: 5.0.3
elementType: C H C H C C C H H C H H C C H H H H H H H
charge: 1
multiplicity: 1
keywords: DSD-PBEP86/2013 cc-pVTZ EnGrad D3BJ RIJCOSX verytightscf cc-pVTZ/C def2/J soscf
formula: C8H13
InChI: InChI=1/C8H13/c1-2-4-6-8-7-5-3-1/h1-2,7H,3-6,8H2
21 atoms
C  -2.003255 0.719946 0.081453
H  -2.208405 0.87561 1.144444
C  -1.765461 -0.927415 -0.143356
H  -2.619477 -1.370913 0.373187
C  -0.430247 -1.354162 0.409795
C  0.698218 -1.284382 -0.363675
C  2.009389 -0.686922 0.071492
H  2.223102 -0.879851 1.128084
H  2.859268 -1.020539 -0.527638
C  1.802615 0.89951 -0.143466
H  1.861909 1.132933 -1.21166
H  2.617423 1.425459 0.357786
C  0.425769 1.275633 0.43438
C  -0.739211 1.318866 -0.368471
H  0.53067 -1.206957 -1.442581
H  -1.852427 -1.128192 -1.213857
H  0.06392 0.172139 0.683857
H  -0.595897 1.326173 -1.453431
H  -2.867911 0.994388 -0.523968
H  0.361388 1.659858 1.459495
H  -0.34752 -1.516113 1.48674
totalener: -311.08453022 hartree
nucrepener: 381.52874039 hartree
electener: -692.61327061 hartree
oneelecener: -1163.18688815 hartree
twoeener: 470.57361754 hartree
kineticenergy: 309.66860226 hartree
exchangeener: -14.113115805568 hartree
correlationener: -0.946857240373 hartree
xcener: -15.059973045941 hartree
chargesum: 1.0000000
charge: -0.246379 0.181047 -0.276220 0.191984 -0.111926 -0.083121 -0.241501 0.164811 0.181018 -0.269389 0.167011 0.183120 -0.147309 0.030052 0.174791 0.178409 0.116019 0.199499 0.195116 0.215525 0.197442
charge: 0.113528 0.002747 0.128407 0.004688 0.058308 0.124523 0.090236 -0.003780 -0.001169 0.114536 -0.008243 -0.001190 0.103167 0.244914 -0.008444 -0.004749 0.006402 0.008914 0.005633 0.027077 -0.005504
qa: -0.2464 0.1810 -0.2762 0.1920 -0.1119 -0.0831 -0.2415 0.1648 0.1810 -0.2694 0.1670 0.1831 -0.1473 0.0301 0.1748 0.1784 0.1160 0.1995 0.1951 0.2155 0.1974
va: 3.8776 0.9787 3.9387 0.9707 3.8096 3.8297 3.8900 0.9842 0.9736 3.9225 0.9833 0.9768 3.8085 3.7034 0.9799 0.9785 1.0929 0.9718 0.9710 0.9744 0.9779
dispcorr: -0.014450637 hartree
energy: -311.783568939192
dipole: 0.02443 -0.41305 -0.38862 0.43529 0.07530 0.51059 0.24434 -0.26863 -0.02429
magnitude: 0.64212 au
magnitude: 1.63214 debye
