program: Gaussian 09
title: 000051138
version: EM64L-G09RevD.01
frameworkgroup: C1[X(C19H34NS)]
method: RPBEPBE
basis: SDD
operation: Freq
keyword: #p
keyword: freq=noraman
keyword: PBEPBE/SDD
title: #p freq=noraman PBEPBE/SDD
converged: YES YES NO NO
title: Mulliken charges:
elementType: S N C C C C C C C C C C C C C C C C C C C H H H H H H H H H H H H H H H H H H H H H H H H H H H H H H H H H H
charge: 0.257398 -0.020181 -0.386273 -0.385070 -0.385567 -0.382773 -0.382571 -0.372676 -0.369004 -0.353799 -0.312733 -0.356042 -0.697094 -0.693509 -0.692956 -0.300790 -0.095687 0.416370 -0.166079 -0.239578 -0.767150 0.200804 0.192420 0.198631 0.192184 0.203409 0.192507 0.191150 0.196235 0.208068 0.189740 0.192731 0.188546 0.212765 0.191210 0.186972 0.190172 0.185368 0.245463 0.196487 0.193981 0.253558 0.291192 0.210730 0.219426 0.209156 0.274073 0.335684 0.288899 0.309324 0.280656 0.287186 0.266359 0.242093 0.268585
chargesum: 1.00000
title: Mulliken charges with hydrogens summed into heavy atoms:
elementType: S N C C C C C C C C C C C C C C C C C C C
charge: 0.257398 -0.020181 0.006951 0.005745 0.010348 0.004611 0.015237 0.008601 0.034971 0.023346 0.118099 0.034426 -0.152344 -0.054197 -0.083199 -0.011891 0.213637 0.416370 0.114577 0.047608 0.009887
polarizability: 2.89990501e+02 -6.96568787e-01 2.30657897e+02 -9.44277287e+00 -3.99038291e+00 1.73732721e+02
1716.lowfreq: -13.9379 -4.7162 -2.5870 -0.0018 -0.0014 0.0002 6.6082 9.8909 13.6597
frequency: 6.3013 7.2876 12.6450 18.0725 24.4307 36.7357 52.0033 61.5844 68.0296 74.2929 84.2298 97.7411 110.5921 118.4685 127.8464 143.6560 149.0241 151.9931 157.7897 188.7974 209.0621 224.2362 227.1881 268.9673 287.5990 301.5697 317.8732 401.0163 403.1108 411.2610 420.3119 485.5024 490.2049 494.9872 522.6201 576.2665 652.2225 678.9037 704.2173 720.2655 722.4714 723.2243 723.4713 730.9089 748.4055 778.4622 813.1643 821.4578 862.7236 880.1154 887.9440 888.3606 901.8814 932.3464 947.7316 978.0761 982.4302 985.4582 1005.2327 1007.3912 1012.5339 1019.1173 1025.3652 1027.0660 1047.4875 1054.2578 1064.8068 1072.3411 1076.7944 1079.9852 1084.4359 1084.9891 1104.4607 1122.0524 1124.9749 1180.6406 1192.6925 1199.3066 1200.1556 1209.4941 1223.6139 1225.2501 1244.1846 1248.4570 1250.1019 1270.6892 1271.2551 1278.3238 1281.1616 1285.9164 1287.9561 1292.7487 1297.0349 1297.6693 1299.2298 1319.0648 1336.0025 1337.3704 1346.9766 1352.7586 1356.1825 1356.8992 1368.8098 1390.0519 1410.1515 1426.0887 1437.0018 1441.4673 1459.3978 1459.4902 1461.8277 1462.9332 1463.9132 1464.4796 1467.8705 1472.8525 1476.4890 1477.7864 1481.6402 1482.6245 1486.6051 1488.9048 1494.9961 1579.4065 1617.9837 2949.8665 2950.5920 2952.2062 2953.4387 2955.5341 2958.6850 2961.3569 2964.3235 2967.8718 2968.9707 2973.2761 2983.4550 2987.7685 2993.2691 2997.1549 2999.9360 3007.5820 3012.5203 3017.4197 3027.0354 3035.8517 3042.9304 3050.9160 3055.7467 3068.7651 3073.8320 3079.7963 3089.1048 3109.1904 3135.2208 3164.2708 3184.0463 3188.7342 3205.3353
redmass: 4.1545 3.9476 2.2635 3.5217 2.8252 3.2422 1.6445 3.4150 1.0734 3.2841 1.6183 3.0474 3.0551 2.0185 2.5250 1.9382 2.8915 3.6654 2.6292 3.5593 2.8019 1.1681 3.2990 2.9382 4.0715 3.4784 3.1284 2.6488 3.5892 3.2118 2.9232 3.0424 3.1382 3.6617 4.9865 5.4284 5.0816 2.6272 4.0614 1.0600 1.0954 4.2549 1.0877 1.1094 1.1449 1.1900 1.4778 1.2383 1.4790 1.4854 1.9058 1.7159 2.1165 1.2645 1.3652 5.0997 1.2061 4.8223 1.4016 1.4360 3.9800 5.3396 1.1076 3.6916 3.2879 1.5711 2.7318 2.8880 2.3430 2.1313 1.7497 1.4764 2.1508 2.8028 1.7118 1.8975 1.2514 1.2526 1.5631 1.1200 1.2673 1.4240 1.6454 1.5336 1.3222 1.2751 1.2559 1.0367 1.1530 1.1382 1.1338 1.0905 1.2672 1.1243 1.1251 1.3483 1.3977 1.3103 1.5014 1.6530 1.6199 1.6383 4.1078 1.2159 1.2448 1.2703 1.4819 1.1003 1.0740 1.0745 1.0713 1.0696 1.0469 1.0655 1.0834 1.0835 1.0426 1.0862 1.1848 1.0958 1.0955 1.0966 2.3475 5.3510 5.0181 1.0586 1.0586 1.0591 1.0591 1.0596 1.0595 1.0610 1.0615 1.0608 1.0617 1.0362 1.0958 1.0965 1.0977 1.0383 1.0993 1.1003 1.0633 1.1009 1.1030 1.1032 1.1033 1.1015 1.0569 1.1007 1.0992 1.0977 1.1057 1.0998 1.1103 1.0928 1.0944 1.0927 1.1010
irintensity: 1.2836 0.5013 0.1127 0.7124 0.3053 0.2328 0.0462 0.8010 0.7705 0.1115 0.0374 0.5468 1.2306 0.4528 0.2322 0.0139 1.7946 1.1300 1.1192 0.0752 2.6224 0.0793 1.3991 1.4709 0.8724 2.2486 1.4117 0.9168 2.1367 0.2271 2.8816 0.8411 1.1790 3.2684 0.6970 5.2115 16.7537 12.3174 49.8182 14.6800 7.0480 9.2604 4.9282 0.8692 1.1428 0.4004 33.9861 1.0988 4.9117 2.7726 4.1166 4.2956 11.2445 1.1191 2.7617 0.0543 0.4327 3.0515 0.2286 0.7393 2.6954 3.0821 0.5549 0.6985 1.8511 12.4268 0.1462 2.0245 0.3931 0.0992 0.1112 1.9362 13.1447 22.2867 51.2742 0.3471 6.6512 22.9527 0.5738 1.0460 2.0077 0.8293 7.5062 3.5069 0.8072 1.3674 3.1245 0.3453 2.0181 0.6162 0.1522 0.6549 4.9035 0.1685 1.0303 4.2841 3.8452 0.3185 0.3184 0.1155 0.1627 0.5669 3.8948 11.3112 37.2149 18.1084 9.1839 1.6256 0.1353 0.1183 0.2197 0.8297 15.1998 5.4000 1.4707 1.4828 13.0158 3.0809 31.6734 4.6522 3.3227 40.8760 53.8736 10.3485 11.8897 0.0070 0.2566 0.2832 0.4893 1.5890 2.0832 10.5386 16.7029 16.1592 284.7260 39.3878 3.1356 2.1097 2.2787 0.6189 1.1297 0.9732 19.5799 2.3240 4.5103 8.3600 144.8759 141.9798 3.2758 94.0689 51.2886 2.3476 18.4716 7.6460 2.4344 0.3086 0.5122 3.0474 3.6960
temp: 298.150 k
press: 1.00000 atm
elementType: 16 7 6 6 6 6 6 6 6 6 6 6 6 6 6 6 6 6 6 6 6 1 1 1 1 1 1 1 1 1 1 1 1 1 1 1 1 1 1 1 1 1 1 1 1 1 1 1 1 1 1 1 1 1 1
symmnumber: 1
zpe: 1286528.3 jmol-1
zpe.correction: 0.490013 hartree
zpe.thermalcorrener: 0.516512 hartree
zpe.thermalcorrenthalpy: 0.517456 hartree
zpe.thermalcorrgfe: 0.424317 hartree
zpe.sumelectzpe: -1195.325375 hartree
zpe.sumelectthermal: -1195.298876 hartree
zpe.sumelectthermalent: -1195.297931 hartree
zpe.sumelectthermalfe: -1195.391070 hartree
dipole: 23.2537 4.4190 0.4907
dipole: 23.6749
quadrupole: 17.1554 -113.7475 -132.8823
quadrupole: 30.8056 0.6159 -0.6446
quadrupole: 93.6469 -37.2560 -56.3908 30.8056 0.6159 -0.6446
hfenergy: -1195.8153873 hartree
pointgroup: C01 [X(C19H34N1S1)]
dipole: -9.2618839 0.926599 0.3430137 debye
polarizability: 289.6626668|9.6558059|205.0802075|-2.6969381|28.9220173|199.6382442 unknown
InChI: InChI=1S/C19H34NS/c1-3-4-5-6-7-8-9-10-11-12-16-21-18-20-15-13-14-19(2)17-20/h13-15,17H,3-12,16,18H2,1-2H3
charge 1 multiplicity 1
55 atoms
S  -3.996962 -2.195552 -2.103225
N  -5.283942 0.037458 -0.922872
C  3.665551 -0.27691 -0.567059
C  4.861547 -0.352119 0.408455
C  2.393645 -0.968552 -0.025549
C  6.123164 0.37131 -0.114621
C  1.202269 -0.901088 -1.007352
C  7.32129 0.288157 0.857807
C  -0.077406 -1.570343 -0.453247
C  8.573419 1.04083 0.353824
C  -1.258834 -1.506972 -1.454558
C  9.771962 0.95159 1.325999
C  -2.521948 -2.167527 -0.884879
C  11.01294 1.721987 0.826021
C  -4.466916 -0.394062 -2.127316
C  -4.841051 1.068227 -0.125709
C  -6.461629 -0.615538 -0.652385
C  -5.575759 1.502502 0.996723
C  -7.242179 -0.219752 0.442307
C  -6.802117 0.835958 1.269692
C  -5.070871 2.633898 1.861338
H  3.952513 -0.73967 -1.534122
H  3.439542 0.787864 -0.786547
H  5.106286 -1.416166 0.608479
H  4.568181 0.087877 1.384805
H  2.623575 -2.030157 0.20148
H  2.106157 -0.49896 0.9386
H  5.881051 1.437952 -0.305932
H  6.415982 -0.061027 -1.094197
H  1.486873 -1.388793 -1.962051
H  0.988531 0.161137 -1.250552
H  7.579924 -0.777432 1.031403
H  7.021737 0.699272 1.844911
H  0.141338 -2.629882 -0.210116
H  -0.3626 -1.081147 0.501658
H  8.318111 2.108482 0.186817
H  8.874695 0.635727 -0.634971
H  -1.45202 -0.444271 -1.71245
H  -0.974137 -2.012069 -2.396504
H  10.035201 -0.114466 1.482665
H  9.466204 1.344587 2.317394
H  -2.864204 -1.696629 0.054452
H  -2.36029 -3.241055 -0.683202
H  11.357718 1.329964 -0.149522
H  11.854444 1.640605 1.538055
H  10.785871 2.796729 0.693201
H  -3.574615 0.246936 -2.177137
H  -5.080151 -0.245946 -3.029793
H  -3.896458 1.535447 -0.41424
H  -6.726275 -1.443363 -1.313305
H  -8.181663 -0.740993 0.639234
H  -7.406407 1.144866 2.128985
H  -4.951676 2.305861 2.9095
H  -4.099567 3.02239 1.515206
H  -5.788744 3.473931 1.865103
