program: Orca
programVersion: 5.0.3
elementType: C H C H C C C H H C H H C C H H H H H H H
charge: 1
multiplicity: 1
keywords: DSD-PBEP86/2013 cc-pVTZ EnGrad D3BJ RIJCOSX verytightscf cc-pVTZ/C def2/J soscf
formula: C8H13
InChI: InChI=1/C8H13/c1-2-4-6-8-7-5-3-1/h1-2,7H,3-6,8H2
21 atoms
C  -1.99864 0.740193 0.076555
H  -2.189522 0.862388 1.146201
C  -1.747069 -0.940491 -0.147572
H  -2.61837 -1.33836 0.377924
C  -0.42637 -1.36954 0.403275
C  0.694078 -1.284067 -0.366973
C  2.006658 -0.687466 0.067245
H  2.219205 -0.878119 1.124935
H  2.858618 -1.026202 -0.526985
C  1.797813 0.887788 -0.145122
H  1.854647 1.130854 -1.2114
H  2.608443 1.422514 0.354925
C  0.422771 1.257858 0.455117
C  -0.755925 1.317662 -0.377311
H  0.529621 -1.21325 -1.446726
H  -1.844554 -1.123685 -1.218886
H  0.118308 0.310124 0.967057
H  -0.630205 1.419229 -1.459126
H  -2.872845 0.985835 -0.526567
H  0.39291 1.896097 1.352771
H  -0.346121 -1.513078 1.48242
totalener: -311.09437478 hartree
nucrepener: 380.60832536 hartree
electener: -691.70270013 hartree
oneelecener: -1161.50146033 hartree
twoeener: 469.79876019 hartree
kineticenergy: 309.70452382 hartree
exchangeener: -14.115346818827 hartree
correlationener: -0.944813435880 hartree
xcener: -15.060160254707 hartree
chargesum: 1.0000000
charge: -0.252346 0.190485 -0.258158 0.197638 -0.143891 -0.109035 -0.239227 0.158833 0.176594 -0.264377 0.162980 0.180655 -0.223426 0.088266 0.168331 0.185632 0.148065 0.214575 0.200671 0.227274 0.190462
charge: 0.124189 0.009173 0.150531 0.008441 0.028617 0.091951 0.082716 -0.005018 -0.003458 0.109592 -0.011671 -0.002062 0.086286 0.294291 -0.015017 -0.002180 0.009163 0.013292 0.007740 0.037809 -0.014385
qa: -0.2523 0.1905 -0.2582 0.1976 -0.1439 -0.1090 -0.2392 0.1588 0.1766 -0.2644 0.1630 0.1807 -0.2234 0.0883 0.1683 0.1856 0.1481 0.2146 0.2007 0.2273 0.1905
va: 3.8851 0.9749 3.9281 0.9673 3.8235 3.8388 3.9015 0.9861 0.9753 3.9034 0.9842 0.9766 3.8463 3.6069 0.9815 0.9748 1.0406 0.9659 0.9704 0.9660 0.9809
dispcorr: -0.014372697 hartree
energy: -311.788224450923
dipole: 0.07513 -0.80754 -0.73242 0.87611 -0.02111 0.85500 0.39056 -0.44381 -0.05325
magnitude: 1.12708 au
magnitude: 2.86480 debye
