program: Gaussian 09
title: 000051073
version: EM64L-G09RevD.01
frameworkgroup: C1[X(C13H22N2)]
method: RPBEPBE
basis: SDD
operation: Freq
keyword: #pfreq=noraman
keyword: PBEPBE/SDD
title: #p freq=noraman PBEPBE/SDD
converged: YES YES NO NO
title: Mulliken charges:
elementType: N N C C C C C C C C C C C C C H H H H H H H H H H H H H H H H H H H H H H
charge: -0.262456 -0.074032 0.440352 -0.369417 0.229644 -0.533156 -0.413223 -0.423153 0.184002 -0.540659 -0.579675 -0.349097 -0.826215 -0.623259 -0.614720 0.224276 0.210236 0.209515 0.224932 0.210538 0.209486 0.217401 0.205186 0.227670 0.214909 0.252571 0.193702 0.218214 0.212862 0.226587 0.223994 0.185988 0.236844 0.218758 0.187613 0.220992 0.222791
chargesum: 0.00000
title: Mulliken charges with hydrogens summed into heavy atoms:
elementType: N N C C C C C C C C C C C C C
charge: -0.262456 -0.074032 0.440352 0.065095 0.229644 -0.098709 0.006801 -0.000566 0.184002 -0.098081 -0.327105 0.062818 -0.162772 0.018331 0.016676
polarizability: 1.83121300e+02 -3.00915423e+00 1.61798488e+02 7.06144358e+00 4.21713023e+00 1.10591126e+02
1716.lowfreq: -22.4094 -11.3089 -6.6512 -0.0005 0.0003 0.0004 19.5942 27.3504 53.9111
frequency: 10.1269 27.0271 53.8664 65.1924 88.3293 104.9199 128.1714 189.3233 192.4366 226.6657 230.2549 251.6428 272.3288 285.2200 307.6717 323.6734 348.1265 418.3068 425.3416 444.3277 451.6441 512.5308 579.8472 621.5479 640.7555 666.2248 723.7969 770.0314 792.8576 809.4104 829.0101 835.4848 871.9782 921.8717 943.0222 971.8539 977.0404 1007.3785 1030.3445 1039.7252 1042.9874 1055.1839 1087.5556 1087.9232 1093.4806 1112.6304 1135.1132 1146.6511 1158.8569 1167.2459 1174.8885 1204.1098 1224.0788 1250.4682 1261.5924 1262.6129 1288.7155 1294.5923 1314.5093 1333.9575 1343.4989 1349.1554 1360.1416 1362.8862 1396.8777 1415.3605 1418.5913 1430.6572 1440.9860 1458.8094 1461.1306 1463.4478 1468.8084 1469.9287 1472.0589 1474.2500 1475.0329 1477.8318 1482.2255 1486.4246 1491.1398 1523.9162 1589.4714 2837.2783 2840.8026 2860.3977 2948.2665 2954.6407 2963.1730 2981.7447 2982.8944 2988.6841 3009.6404 3015.1674 3028.2483 3028.6684 3035.6234 3035.9595 3047.0328 3048.2423 3057.3216 3064.7579 3073.9080 3085.7969 3194.9750
redmass: 2.5601 3.4195 3.1175 1.0307 2.7747 2.1679 2.8069 2.5374 2.6773 1.4293 1.1544 2.0223 2.6250 2.6194 1.8712 2.4793 2.6484 3.5764 3.3076 2.3581 2.4739 2.7312 3.7293 3.4933 2.8165 4.5011 2.6583 1.8931 1.3094 2.2012 1.5427 3.4243 2.2656 1.4002 2.4510 2.0882 1.5037 2.9180 1.5527 1.5576 1.9241 2.4055 1.5685 1.3409 1.6146 2.1103 1.7826 1.3503 1.6642 1.4253 1.6615 2.6630 1.8744 1.2722 2.3016 1.2834 1.2043 1.5883 1.5207 1.4670 1.5664 1.5342 1.6176 2.2293 1.2767 1.1610 2.7346 4.0684 1.1639 1.0765 1.0627 1.1037 1.0500 1.0937 1.0775 1.0943 1.0957 1.0537 1.1234 1.0763 1.1704 6.2842 6.3145 1.0682 1.0580 1.0591 1.0684 1.0668 1.0376 1.0634 1.0610 1.0617 1.0873 1.0721 1.0917 1.0718 1.0969 1.0946 1.0988 1.0986 1.1043 1.0976 1.1008 1.0999 1.0974
irintensity: 0.6430 0.4350 0.0271 0.2499 0.7441 0.6904 0.4537 4.5449 3.0570 1.4498 0.4247 0.3197 1.1684 0.4639 0.9525 5.8687 6.1943 0.5765 7.1287 0.8907 0.7361 2.7950 1.2439 3.7367 3.4019 0.2952 3.2793 3.3783 28.7538 8.6551 2.5996 11.9033 4.4679 1.3778 2.4941 2.6899 1.9057 14.6843 21.3165 6.6805 6.4187 32.3772 1.4385 6.0352 4.2974 5.5672 3.6850 1.2660 8.1199 0.6869 9.7929 3.9682 16.2555 8.8645 5.6334 8.1363 4.4828 3.9766 4.6884 15.3356 1.1912 1.8717 22.6244 21.3084 11.8616 5.2179 12.5976 23.6801 0.9560 8.4019 19.0659 2.7673 14.0496 12.9071 1.9638 10.7310 6.4079 15.7380 1.6533 31.2500 2.5961 8.6358 2.7668 51.9615 70.4489 220.0668 60.5628 55.1380 63.3516 36.0488 28.8966 25.8038 18.3302 47.3977 41.2341 44.5218 21.8601 32.2607 38.7475 68.9352 60.6131 35.1901 41.2546 44.1869 7.9286
temp: 298.150 k
press: 1.00000 atm
elementType: 7 7 6 6 6 6 6 6 6 6 6 6 6 6 6 1 1 1 1 1 1 1 1 1 1 1 1 1 1 1 1 1 1 1 1 1 1
symmnumber: 1
zpe: 858214.8 jmol-1
zpe.correction: 0.326877 hartree
zpe.thermalcorrener: 0.343293 hartree
zpe.thermalcorrenthalpy: 0.344237 hartree
zpe.thermalcorrgfe: 0.280813 hartree
zpe.sumelectzpe: -616.887283 hartree
zpe.sumelectthermal: -616.870866 hartree
zpe.sumelectthermalent: -616.869922 hartree
zpe.sumelectthermalfe: -616.933347 hartree
dipole: -0.1166 -1.6427 0.2985
dipole: 1.6737
quadrupole: -84.8276 -90.8867 -94.4603
quadrupole: -5.1061 -0.8415 -0.6163
quadrupole: 5.2307 -0.8285 -4.4021 -5.1061 -0.8415 -0.6163
hfenergy: -617.2141596 hartree
pointgroup: C01 [X(C13H22N2)]
dipole: 0.0431181 -0.6379439 -0.157341 debye
polarizability: 183.2631107|2.5180807|162.1124675|6.5317758|-1.0823566|110.1353356 unknown
InChI: InChI=1S/C13H22N2/c1-11-10-12-6-4-5-8-15(12)13(11)7-9-14(2)3/h10H,4-9H2,1-3H3
charge 0 multiplicity 1
37 atoms
N  -1.095495 -0.158356 0.24953
N  3.483398 -0.907485 -0.057935
C  -2.228377 0.569188 -0.147555
C  -1.051406 -1.627736 0.375803
C  0.002749 0.718211 0.393181
C  -3.570869 -0.100805 -0.322725
C  -2.470034 -2.210609 0.540613
C  -3.426617 -1.629678 -0.525696
C  -0.449527 2.016159 0.089629
C  1.379769 0.23797 0.769906
C  -1.847984 1.912656 -0.247254
C  2.215402 -0.244324 -0.447951
C  0.373447 3.282443 0.103027
C  4.43744 0.002901 0.607806
C  4.109607 -1.60762 -1.198499
H  -0.418545 -1.899708 1.2401
H  -0.577756 -2.065306 -0.528187
H  -4.203792 0.07561 0.573176
H  -4.10652 0.356219 -1.175477
H  -2.858052 -1.971912 1.550374
H  -2.408599 -3.312012 0.460987
H  -4.418154 -2.114587 -0.460177
H  -3.022682 -1.843253 -1.535748
H  1.905604 1.067855 1.276317
H  1.33944 -0.596274 1.497689
H  -2.508009 2.735864 -0.521738
H  2.38856 0.628098 -1.131435
H  1.617454 -0.98052 -1.018732
H  1.366904 3.120342 0.559208
H  0.543197 3.67379 -0.919371
H  -0.12864 4.084529 0.676551
H  4.745102 0.866302 -0.037833
H  4.000832 0.407731 1.536239
H  5.348146 -0.558392 0.883823
H  4.435914 -0.91919 -2.020119
H  4.997904 -2.166007 -0.851095
H  3.39579 -2.333892 -1.627233
