program: Orca
programVersion: 5.0.3
elementType: C H C H C C C H H C H H C C H H H H H H H
charge: 1
multiplicity: 1
keywords: PBE0 cc-pVTZ EnGrad D3BJ RIJCOSX verytightscf cc-pVTZ/C def2/J soscf
formula: C8H13
InChI: InChI=1/C8H13/c1-2-4-6-8-7-5-3-1/h1-2,7H,3-6,8H2
21 atoms
C  -1.996704 0.532596 0.120007
H  -2.173758 0.723856 1.18198
C  -1.946693 -0.994356 -0.171541
H  -2.674962 -1.584656 0.387249
C  -0.512365 -1.154205 0.285966
C  0.613024 -1.133165 -0.500426
C  1.908489 -0.655441 0.066457
H  2.012124 -0.951945 1.115629
H  2.766164 -1.043977 -0.48953
C  1.888343 0.908652 -0.040395
H  2.005624 1.197804 -1.091488
H  2.737528 1.33018 0.50399
C  0.553603 1.481539 0.492915
C  -0.557641 0.851109 -0.269131
H  0.532133 -1.303606 -1.573597
H  -2.05699 -1.200573 -1.240358
H  0.434758 1.348633 1.572998
H  -0.427801 0.913687 -1.352502
H  -2.725754 1.091561 -0.475827
H  0.535185 2.565455 0.291178
H  -0.363521 -1.103872 1.365964
totalener: -312.07952130 hartree
nucrepener: 385.01024815 hartree
electener: -697.08976945 hartree
oneelecener: -1170.87626927 hartree
twoeener: 473.78649982 hartree
kineticenergy: 309.65238256 hartree
exchangeener: -34.167990129984 hartree
correlationener: -1.972638987774 hartree
xcener: -36.140629117758 hartree
chargesum: 1.0000000
charge: -0.157220 0.144689 -0.167374 0.155022 -0.054832 -0.062009 -0.182546 0.140994 0.156304 -0.199881 0.139222 0.153215 -0.165163 -0.055688 0.192634 0.142456 0.142087 0.180965 0.155062 0.171688 0.170377
charge: 0.093714 0.001217 0.098115 -0.000146 0.122825 0.149876 0.080261 0.002412 0.007697 0.098020 -0.004643 0.000836 0.064904 0.241546 -0.000252 0.000968 0.000824 0.004170 0.003033 0.027576 0.007047
qa: -0.1572 0.1447 -0.1674 0.1550 -0.0548 -0.0620 -0.1825 0.1410 0.1563 -0.1999 0.1392 0.1532 -0.1652 -0.0557 0.1926 0.1425 0.1421 0.1810 0.1551 0.1717 0.1704
va: 3.8539 0.9948 3.8708 0.9877 3.8026 3.7950 3.9007 0.9932 0.9878 3.8758 0.9894 0.9854 3.8748 3.7237 0.9775 0.9961 0.9929 0.9867 0.9861 0.9797 0.9923
dispcorr: -0.018378022 hartree
energy: -312.097899324120
dipole: 0.56296 -0.73564 -0.17268 1.85581 -1.66542 0.19039 0.18322 -0.32653 -0.14331
magnitude: 0.29429 au
magnitude: 0.74802 debye
