program: Orca
programVersion: 5.0.3
elementType: C H C H C C C H H C H H C C H H H H H H H
charge: 1
multiplicity: 1
keywords: DSD-PBEP86 def2-TZVP RIJCOSX verytightscf def2-TZVP/C def2/J soscf noTRAH
formula: C8H13
InChI: InChI=1/C8H13/c1-2-4-6-8-7-5-3-1/h1-2,7H,3-6,8H2
21 atoms
C  -2.00118 0.75511 0.069179
H  -2.163172 0.81911 1.147818
C  -1.730073 -0.973257 -0.162881
H  -2.618976 -1.328141 0.36287
C  -0.412901 -1.387169 0.389835
C  0.683431 -1.272793 -0.38345
C  1.998516 -0.696317 0.062614
H  2.203862 -0.900836 1.118857
H  2.854354 -1.036047 -0.527094
C  1.787734 0.846095 -0.13587
H  1.823372 1.10961 -1.198734
H  2.591938 1.396736 0.359276
C  0.423757 1.27787 0.494742
C  -0.766865 1.294418 -0.364447
H  0.518349 -1.193878 -1.462709
H  -1.830568 -1.132495 -1.237054
H  0.208968 0.687276 1.389177
H  -0.659236 1.623987 -1.401574
H  -2.882936 0.997013 -0.522556
H  0.495739 2.323581 0.866332
H  -0.328891 -1.478056 1.472022
totalener: -311.13579446 hartree
nucrepener: 379.26048563 hartree
electener: -690.39628009 hartree
oneelecener: -1158.96110740 hartree
twoeener: 468.56482731 hartree
kineticenergy: 309.99936531 hartree
exchangeener: -12.754286922560 hartree
correlationener: -0.942948249261 hartree
xcener: -13.697235171821 hartree
chargesum: 1.0000000
charge: -0.280465 0.201119 -0.195502 0.193576 -0.211953 -0.105680 -0.214019 0.154688 0.165793 -0.270224 0.153344 0.170123 -0.154998 0.110607 0.140702 0.188235 0.154347 0.217175 0.196480 0.213309 0.173345
charge: -0.166955 0.169027 -0.110766 0.157129 -0.185570 -0.121587 -0.215806 0.148622 0.148194 -0.201712 0.142211 0.150302 -0.207331 0.147169 0.151320 0.152325 0.167291 0.174322 0.157263 0.195915 0.148637
qa: -0.2805 0.2011 -0.1955 0.1936 -0.2120 -0.1057 -0.2140 0.1547 0.1658 -0.2702 0.1533 0.1701 -0.1550 0.1106 0.1407 0.1882 0.1543 0.2172 0.1965 0.2133 0.1733
va: 3.8803 0.9575 3.8266 0.9577 3.8498 3.8462 3.8727 0.9727 0.9733 3.9050 0.9691 0.9669 3.7906 3.5368 0.9686 0.9584 0.9928 0.9437 0.9651 0.9459 0.9638
total: -311.818504680 hartree
energy: -311.818504679660
dipole: 0.19927 -1.09322 -0.89395 1.76794 -0.50693 1.26101 0.34331 -0.52976 -0.18645
magnitude: 1.55693 au
magnitude: 3.95741 debye
