program: Orca
programVersion: 5.0.3
elementType: C H C H C C C H H C H H C C H H H H H H H
charge: 1
multiplicity: 1
keywords: b3lyp cc-pVTZ EnGrad RIJCOSX verytightscf cc-pVTZ/C def2/J soscf
formula: C8H13
InChI: InChI=1/C8H13/c1-2-4-6-8-7-5-3-1/h1-2,7H,3-6,8H2
21 atoms
C  -2.005951 0.706024 0.085342
H  -2.216379 0.879517 1.144719
C  -1.78011 -0.92201 -0.14057
H  -2.622274 -1.393925 0.369348
C  -0.433509 -1.344577 0.41155
C  0.69938 -1.282376 -0.362172
C  2.010562 -0.685845 0.075342
H  2.224798 -0.881741 1.130834
H  2.858692 -1.016902 -0.527112
C  1.805895 0.906177 -0.141035
H  1.866767 1.134081 -1.210223
H  2.622404 1.426829 0.362557
C  0.429739 1.289837 0.423228
C  -0.725974 1.313884 -0.361502
H  0.530517 -1.201884 -1.440593
H  -1.859102 -1.130171 -1.211326
H  0.031266 0.093472 0.484974
H  -0.574355 1.287383 -1.445038
H  -2.864789 1.001017 -0.519173
H  0.348498 1.526779 1.488672
H  -0.346441 -1.499686 1.489177
totalener: -312.18083101 hartree
nucrepener: 382.13971372 hartree
electener: -694.32054472 hartree
oneelecener: -1164.92882020 hartree
twoeener: 470.60827548 hartree
kineticenergy: 309.93685635 hartree
exchangeener: -36.290788970078 hartree
correlationener: -2.308149360151 hartree
xcener: -38.598938330230 hartree
chargesum: 1.0000000
charge: -0.190069 0.148378 -0.213850 0.160878 -0.071878 -0.034922 -0.186406 0.140359 0.156760 -0.206345 0.140948 0.156209 -0.078144 0.015888 0.150595 0.146333 0.102710 0.164337 0.164280 0.170766 0.163172
charge: 0.112893 -0.001687 0.123524 0.001453 0.085672 0.146450 0.100681 -0.004225 -0.000484 0.119941 -0.007280 -0.001215 0.112666 0.207075 -0.004927 -0.006296 -0.002422 0.004156 0.002804 0.014252 -0.003030
qa: -0.1901 0.1484 -0.2138 0.1609 -0.0719 -0.0349 -0.1864 0.1404 0.1568 -0.2063 0.1409 0.1562 -0.0781 0.0159 0.1506 0.1463 0.1027 0.1643 0.1643 0.1708 0.1632
va: 3.8331 0.9879 3.8778 0.9802 3.7690 3.7725 3.8397 0.9899 0.9800 3.8720 0.9896 0.9832 3.7634 3.7132 0.9910 0.9877 1.0869 0.9866 0.9795 0.9920 0.9924
energy: -312.180831008544
dipole: -0.00037 -0.18077 -0.18114 0.21090 0.05326 0.26416 0.10961 -0.13545 -0.02584
magnitude: 0.32134 au
magnitude: 0.81679 debye
