program: Orca
programVersion: 5.0.3
elementType: C H C H C C C H H C H H C C H H H H H H H
charge: 1
multiplicity: 1
keywords: m062x def2-TZVP EnGrad RIJCOSX verytightscf def2/J soscf
formula: C8H13
InChI: InChI=1/C8H13/c1-2-4-6-8-7-5-3-1/h1-2,7H,3-6,8H2
21 atoms
C  -1.994847 0.538912 0.118492
H  -2.170767 0.727541 1.181287
C  -1.927856 -0.988595 -0.173392
H  -2.672866 -1.571904 0.371364
C  -0.500787 -1.18354 0.294978
C  0.618491 -1.152679 -0.492777
C  1.911549 -0.662715 0.068908
H  2.023149 -0.95109 1.119536
H  2.773661 -1.042259 -0.486919
C  1.875506 0.899231 -0.049909
H  1.976302 1.181689 -1.104663
H  2.726816 1.33548 0.479628
C  0.545077 1.479598 0.498377
C  -0.576987 0.90604 -0.280009
H  0.533511 -1.308019 -1.568042
H  -2.028382 -1.189903 -1.24433
H  0.421084 1.322428 1.574341
H  -0.442187 0.976418 -1.362398
H  -2.743937 1.076158 -0.473474
H  0.557806 2.569716 0.323906
H  -0.354541 -1.138018 1.375722
totalener: -312.30872548 hartree
nucrepener: 384.06534741 hartree
electener: -696.37407289 hartree
oneelecener: -1168.82318673 hartree
twoeener: 472.44911384 hartree
kineticenergy: 310.39345613 hartree
xcener: -23.102381915411 hartree
chargesum: 1.0000000
charge: -0.284854 0.203569 -0.292500 0.201826 -0.082551 -0.069843 -0.333414 0.203014 0.202591 -0.302410 0.200904 0.200260 -0.299320 -0.012930 0.211626 0.200486 0.198320 0.227164 0.202610 0.223431 0.202020
charge: -0.205636 0.159664 -0.199186 0.155488 -0.065445 -0.062365 -0.218520 0.159657 0.163199 -0.212889 0.153216 0.156833 -0.231169 0.069116 0.165514 0.158306 0.159806 0.173952 0.160883 0.189519 0.170059
qa: -0.2849 0.2036 -0.2925 0.2018 -0.0826 -0.0698 -0.3334 0.2030 0.2026 -0.3024 0.2009 0.2003 -0.2993 -0.0129 0.2116 0.2005 0.1983 0.2272 0.2026 0.2234 0.2020
va: 3.7364 0.9532 3.7386 0.9624 3.6929 3.6426 3.7665 0.9473 0.9585 3.6979 0.9461 0.9561 3.7423 3.5149 0.9473 0.9536 0.9516 0.9330 0.9600 0.9455 0.9480
energy: -312.308725480034
dipole: 0.56195 -0.79659 -0.23464 1.86114 -1.50957 0.35157 0.17409 -0.31734 -0.14325
magnitude: 0.44630 au
magnitude: 1.13439 debye
