program: Gaussian 09
title: 000051035
version: EM64L-G09RevD.01
frameworkgroup: C1[X(C7H7N3O4)]
method: RPBEPBE
basis: SDD
operation: Freq
keyword: #pfreq=noraman
keyword: PBEPBE/SDD
title: #p freq=noraman PBEPBE/SDD
converged: NO YES NO NO
title: Mulliken charges:
elementType: O O O O N N N C C C C C C C H H H H H H H
charge: -0.194213 -0.259589 -0.202637 -0.255543 0.024413 -0.638550 0.026337 0.452370 0.137577 0.184937 0.265771 -0.411202 -0.390110 -0.776935 0.253374 0.294912 0.262163 0.262046 0.221734 0.369437 0.373709
chargesum: 0.00000
title: Mulliken charges with hydrogens summed into heavy atoms:
elementType: O O O O N N N C C C C C C C
charge: -0.194213 -0.259589 -0.202637 -0.255543 0.024413 0.104596 0.026337 0.452370 0.137577 0.184937 0.265771 -0.157828 -0.095198 -0.030992
polarizability: 1.94368488e+02 -2.28193061e+00 1.45688828e+02 -6.52856346e-04 -1.06375381e-02 4.78024240e+01
1716.lowfreq: -41.3868 -14.9391 -11.6773 -5.1496 0.0004 0.0010 0.0011 55.8028 92.1647
frequency: -41.3839 55.7953 92.1542 111.9660 231.6280 254.7400 267.9454 287.9777 322.8189 334.2320 364.5534 392.2374 424.2673 461.2942 466.8621 562.8836 582.5461 606.4386 644.2593 645.4769 694.6311 707.2741 735.0010 764.3823 804.1024 819.7686 826.9529 844.3732 974.2241 990.0397 1034.1969 1047.3469 1094.8229 1104.4643 1159.6653 1171.8932 1189.4409 1250.0063 1307.4135 1337.8508 1352.7003 1383.4565 1403.6935 1444.6049 1450.2461 1476.9766 1485.3475 1528.3762 1578.0545 1608.0321 3000.0348 3083.1926 3102.3934 3165.5135 3187.7521 3309.4050 3457.0232
redmass: 7.9575 12.0875 4.6775 7.0777 10.7521 5.0355 1.3036 2.6053 6.4253 12.9097 6.8842 4.7368 3.5365 9.8893 4.3611 5.5576 3.9897 4.7337 6.9595 7.3601 7.0837 9.1338 7.9729 10.2960 1.0677 1.1812 1.2692 5.9909 2.0389 1.3404 1.5760 2.0448 7.3176 2.6839 3.5606 3.5303 2.7957 1.9985 4.0069 4.2030 4.2422 2.6760 1.5370 2.5959 1.0472 1.2945 2.8665 1.5874 5.3285 8.0031 1.0366 1.0951 1.1017 1.0891 1.0962 1.0449 1.1092
irintensity: 1.2830 2.9319 0.8400 1.7446 11.4533 0.6306 3.6056 0.4575 1.4325 0.2137 1.0541 2.0125 2.5602 2.3053 4.8048 2.1372 0.7602 4.6192 0.8236 7.4494 5.8285 5.7566 18.1162 5.9097 32.0996 163.3769 100.8619 14.5992 7.8301 2.8855 10.9208 17.1863 18.5538 35.0454 350.7243 201.4870 168.1674 177.4484 113.6182 118.8541 80.3559 62.6735 10.4456 19.8908 13.8132 15.9677 27.3554 100.2916 201.6638 248.7403 5.7990 3.5142 29.4488 5.3651 4.5491 63.7774 213.0861
temp: 298.150 k
press: 1.00000 atm
elementType: 8 8 8 8 7 7 7 6 6 6 6 6 6 6 1 1 1 1 1 1 1
symmnumber: 1
zpe: 382713.7 jmol-1
zpe.correction: 0.145768 hartree
zpe.thermalcorrener: 0.156822 hartree
zpe.thermalcorrenthalpy: 0.157766 hartree
zpe.thermalcorrgfe: 0.108630 hartree
zpe.sumelectzpe: -734.926468 hartree
zpe.sumelectthermal: -734.915413 hartree
zpe.sumelectthermalent: -734.914469 hartree
zpe.sumelectthermalfe: -734.963606 hartree
dipole: -1.4777 3.0705 0.0031
dipole: 3.4076
quadrupole: -106.2172 -73.8521 -80.0259
quadrupole: -8.1178 -0.0093 -0.0033
quadrupole: -19.5188 12.8463 6.6725 -8.1178 -0.0093 -0.0033
hfenergy: -735.0722355 hartree
pointgroup: C01 [X(C7H7N3O4)]
dipole: 0.5667492 1.2149591 -0.0012065 debye
dipolederiv: -1.0611956 -0.0492205 -0.0001471 -0.1192213 -0.432029 -0.0000006 -0.0015228 -0.0003205 -0.2033159 -0.4103207 -0.0127469 -0.0001206 0.1885117 -0.934439 -0.0005902 -0.0003279 0.0003011 -0.2739188 -1.0056474 0.2068728 0.0001799 0.4233767 -0.5297619 -0.000156 0.0001233 -0.000082 -0.2252729 -0.5835059 -0.1324521 0.0000532 -0.4061204 -0.7873896 -0.0000253 -0.0000687 -0.0001105 -0.2672744 1.6997258 -0.2490351 0.000598 -0.4728517 1.2544432 0.0005291 0.0015874 0.0002231 0.1888039 -0.4940377 -0.1165992 -0.0002996 -0.0967991 -1.0574314 -0.0001483 -0.0001722 -0.0001127 -0.5303755 2.1670781 0.0547757 -0.0003184 0.2264408 1.0095363 0.0001741 -0.0001759 0.0002113 0.1949758 0.7891692 0.2176032 -0.0001961 -0.759683 0.4949672 0.0000484 -0.000271 0.0000398 0.0695801 -0.6075794 -0.0249681 -0.0002572 0.6479278 -0.6123238 -0.000024 0.0000471 -0.0001094 -0.0360777 0.3316738 0.0815754 0.0000403 0.0958839 0.9107357 0.0002669 0.0002476 -0.0000485 0.1811223 -0.9275372 0.1012982 0.0001759 -0.7266814 -0.4090914 0.0000148 0.0000252 -0.0001081 -0.0145525 -1.2604219 0.0029905 0.0001184 0.2010277 0.0420669 0.0000193 0.0002795 0.000046 -0.2020941 0.6334144 0.0341472 -0.0000844 0.8755707 0.2103572 -0.0000594 -0.0000293 0.0000386 -0.0314838 -0.3565388 -0.238248 0.0000264 -0.009817 0.148641 -0.0000744 -0.000207 -0.0001444 -0.0015303 0.0601948 -0.0523697 0.0000107 -0.0228347 -0.0601827 -0.0000101 -0.0000111 0.0000149 0.1565898 0.0914688 0.0608946 0.0000324 0.0059485 0.1171597 -0.0000072 0.0000509 -0.0000265 0.1590916 0.0823304 0.0072138 -0.0579137 -0.0104201 0.0592417 0.058246 -0.0549651 0.0331271 0.0078218 0.0822819 0.0072774 0.057936 -0.0104446 0.0590428 -0.0582988 0.0552009 -0.0331145 0.0076841 0.0938406 0.097705 0.000007 -0.042441 -0.16213 0.0000718 0.0000981 0.0001047 0.1063066 0.3243154 -0.0481043 0.0000519 0.0467716 0.3384513 -0.0000482 -0.0000635 0.0000034 0.354972 0.3512914 0.0513901 0.0001069 -0.0341453 0.3401359 0.0000721 0.0001545 0.000067 0.3589479 unknown
polarizability: 194.3062679|2.8691794|145.7510479|-0.0007813|0.0106289|47.802424 unknown
InChI: InChI=1S/C7H7N3O4/c1-4-2-3-5(9(11)12)6(8)7(4)10(13)14/h2-3H,8H2,1H3
charge 0 multiplicity 1
21 atoms
O  3.420996 -0.549769 0.00154
O  2.024735 -2.323599 -0.000096
O  -3.697618 0.74425 0.00063
O  -3.063378 -1.438338 0.000006
N  2.222572 -1.026475 -0.000534
N  -0.516139 -2.019543 -0.000491
N  -2.776567 -0.159302 0.000353
C  1.297532 1.299282 -0.00028
C  1.071757 -0.114695 -0.00042
C  -0.278947 -0.682614 -0.000284
C  -1.375849 0.266271 0.000166
C  0.164144 2.154002 0.00008
C  -1.142637 1.653934 0.000339
C  2.652548 1.977453 -0.000548
H  0.325601 3.235034 0.000152
H  -2.008056 2.321529 0.000641
H  3.257871 1.690444 0.876167
H  3.25777 1.69002 -0.877191
H  2.516334 3.07123 -0.000804
H  -1.502943 -2.315133 0.000022
H  0.303474 -2.641779 -0.001146
