program: Gaussian 09
title: 000051076
version: EM64L-G09RevD.01
frameworkgroup: C1[X(C13H18ClNO2)]
method: RPBEPBE
basis: SDD
operation: Freq
keyword: #p
keyword: freq=noraman
keyword: PBEPBE/SDD
title: #p freq=noraman PBEPBE/SDD
converged: YES YES NO NO
title: Mulliken charges:
elementType: Cl O O N C C C C C C C C C C C C C H H H H H H H H H H H H H H H H H H
charge: -0.032326 -0.297569 -0.224543 -0.271487 -0.448143 0.499160 -0.211895 -0.467016 0.272565 -0.413610 0.466783 -0.204276 -0.435815 -0.198070 -0.742720 -0.810861 -0.678573 0.241473 0.231427 0.198995 0.210991 0.267666 0.235223 0.225176 0.234429 0.196065 0.190859 0.335959 0.266233 0.226321 0.244892 0.219745 0.208381 0.227869 0.236692
chargesum: 0.00000
title: Mulliken charges with hydrogens summed into heavy atoms:
elementType: Cl O O N C C C C C C C C C C C C C
charge: -0.032326 -0.297569 -0.224543 -0.271487 0.024757 0.499160 0.198091 -0.199350 0.272565 -0.178387 0.466783 0.020900 -0.201386 0.188854 -0.140529 -0.119903 -0.005631
polarizability: 2.00264574e+02 1.40127295e+01 1.28751831e+02 -2.70601668e+00 -7.92068093e+00 1.58340514e+02
1716.lowfreq: -6.8578 -2.5431 0.0010 0.0014 0.0016 7.4306 21.6139 31.5699 35.9327
frequency: 21.5668 31.5579 35.9227 46.2125 52.0259 53.8811 73.3257 107.0825 124.8651 147.5995 151.9418 201.5744 212.0234 237.7668 247.2038 260.5848 289.5926 309.9031 378.5573 409.9688 418.1588 442.5615 498.4232 516.1434 534.4327 545.9655 574.1152 627.1621 695.6167 702.1817 747.8324 781.3721 788.8503 813.1972 816.4836 887.4140 901.2107 910.7579 933.7134 937.5971 958.2523 973.1822 989.1379 1001.6619 1030.1876 1049.1921 1067.3747 1080.3568 1098.5758 1106.8574 1120.4075 1138.5844 1171.8839 1178.8972 1182.1876 1198.8008 1222.2136 1251.7680 1261.1554 1286.0094 1305.2873 1334.1339 1349.6560 1366.3850 1380.2899 1390.6165 1398.1415 1403.2434 1426.7900 1434.1142 1462.2589 1467.9949 1470.4904 1472.6073 1475.7757 1480.4835 1485.9714 1493.1904 1596.0082 1604.9981 1622.6464 2922.7040 2931.6593 2978.4317 2978.9280 2983.7993 2995.9880 3030.4180 3034.4160 3059.4488 3086.0355 3090.7294 3094.1417 3102.3682 3117.1278 3122.9441 3134.9721 3155.7289 3162.2208
redmass: 4.0015 4.0049 5.1512 2.1457 1.4753 1.9058 5.2061 5.5810 3.1272 3.2886 3.4336 4.4261 3.5062 1.2770 2.5463 8.0363 5.1468 3.5407 2.5236 2.7796 3.7396 2.8184 3.1284 5.1443 3.7737 4.0840 3.7699 3.9282 5.5407 2.1090 6.1843 2.6364 1.5886 1.8657 1.5670 1.3245 1.9351 1.8821 2.3860 2.0098 1.9625 1.3480 5.0401 1.6140 2.9807 1.5658 2.9476 3.3745 1.5858 2.4094 2.1177 1.4574 1.1978 1.2517 1.2932 2.1166 1.4991 1.1576 1.8965 1.4662 1.3034 1.2923 1.3072 2.1313 7.2613 1.2680 1.2430 1.3741 2.6674 1.0832 1.0402 1.0854 1.1360 1.2699 1.1272 1.0499 1.7281 1.0800 5.9921 7.5700 7.9755 1.0564 1.0559 1.1064 1.0375 1.1038 1.0360 1.0570 1.0619 1.0969 1.0994 1.1017 1.0991 1.1012 1.1080 1.0858 1.0918 1.0981 1.0938
irintensity: 0.1295 0.4542 0.6628 2.1478 2.3951 1.0651 1.3438 5.3727 4.4539 4.0403 6.0338 3.1187 0.6160 2.0714 1.4774 0.2924 4.5770 1.2955 2.1892 2.9616 2.2306 4.0790 5.8676 2.3928 4.3786 3.7171 4.8095 10.1316 12.6048 22.6518 41.3208 1.1427 37.2928 4.0757 6.7204 2.0696 9.5698 19.1103 2.9615 9.3733 0.9374 0.0676 0.2332 1.1341 37.9048 14.0583 155.3292 37.9646 4.0248 19.0981 32.6005 6.0518 4.9860 4.8852 3.4345 77.8619 32.4723 0.2300 33.3772 8.7550 1.7049 21.9234 9.7109 136.6524 0.3042 20.8317 14.9255 13.1763 10.8819 15.3194 10.7379 11.2104 8.8083 10.0957 23.7792 3.0919 58.5068 3.8423 25.9171 79.7267 131.0712 21.3097 115.6994 74.2411 26.9046 21.8445 18.0342 8.6803 41.7433 18.6826 20.7513 21.4247 33.3964 33.3875 10.1166 1.9483 26.6880 25.5958 0.2467
temp: 298.150 k
press: 1.00000 atm
elementType: 17 8 8 7 6 6 6 6 6 6 6 6 6 6 6 6 6 1 1 1 1 1 1 1 1 1 1 1 1 1 1 1 1 1 1
symmnumber: 1
zpe: 749078.7 jmol-1
zpe.correction: 0.285309 hartree
zpe.thermalcorrener: 0.304035 hartree
zpe.thermalcorrenthalpy: 0.304979 hartree
zpe.thermalcorrgfe: 0.235003 hartree
zpe.sumelectzpe: -1170.130162 hartree
zpe.sumelectthermal: -1170.111436 hartree
zpe.sumelectthermalent: -1170.110492 hartree
zpe.sumelectthermalfe: -1170.180468 hartree
dipole: 1.1610 6.3388 -2.6602
dipole: 6.9718
quadrupole: -103.6473 -115.7004 -97.7628
quadrupole: -7.1820 3.2767 5.3967
quadrupole: 2.0562 -9.9969 7.9407 -7.1820 3.2767 5.3967
hfenergy: -1170.4154711 hartree
pointgroup: C01[X(C13H18Cl1N1O2)]
dipole: -0.2295931 2.6078413 0.8185149 debye
polarizability: 197.8630188|-17.3603921|132.5768552|-4.1978095|12.249882|156.9170449 unknown
InChI: InChI=1S/C13H18ClNO2/c1-3-17-8-7-15(13(16)10-14)12-6-4-5-11(2)9-12/h4-6,9H,3,7-8,10H2,1-2H3
charge 0 multiplicity 1
35 atoms
Cl 3.203018 -2.977662 -0.519805
O  2.463392 1.461365 -0.122398
O  0.281135 -2.330358 -0.487822
N  0.284906 -0.416342 0.857227
C  1.018324 0.615687 1.63299
C  -1.136264 -0.189606 0.655413
C  1.395865 1.851397 0.800637
C  -1.679802 -0.154421 -0.649437
C  0.915212 -1.503924 0.219514
C  -1.977532 0.0191 1.776115
C  -3.060768 0.085705 -0.856451
C  -3.350227 0.277094 1.577515
C  -3.8895 0.312417 0.271672
C  2.807042 2.516375 -1.092032
C  2.429897 -1.613238 0.484329
C  -3.635605 0.079828 -2.262321
C  3.92492 1.97938 -1.984317
H  1.932307 0.188203 2.077134
H  0.380131 0.945948 2.470803
H  1.750447 2.661507 1.477162
H  0.509513 2.221943 0.241477
H  -1.024894 -0.341868 -1.505658
H  -1.572353 -0.046223 2.792207
H  -4.002356 0.437457 2.443246
H  -4.958713 0.507108 0.126901
H  1.905172 2.773663 -1.689696
H  3.132741 3.42983 -0.546773
H  2.941884 -0.681498 0.201715
H  2.633595 -1.865389 1.538097
H  -3.000644 0.650837 -2.963852
H  -3.70257 -0.953045 -2.654227
H  -4.649927 0.513981 -2.287665
H  4.208035 2.734451 -2.739836
H  4.818249 1.7334 -1.384752
H  3.596872 1.065598 -2.508913
