program: Orca
programVersion: 5.0.3
charge: 1
multiplicity: 1
keywords: DLPNO-CCSD(T1) tightPNO Extrapolate(3/4,def2) RIJK def2/JK verytightSCF miniprint nopop
formula: C8H13
InChI: InChI=1/C8H13/c1-2-4-6-8-7-5-3-1/h1-2,7H,3-6,8H2
21 atoms
C  -2.002804 0.70954 0.072017
H  -2.175679 0.796196 1.148561
C  -1.747209 -0.969852 -0.171016
H  -2.626102 -1.375045 0.337199
C  -0.410348 -1.373647 0.380127
C  0.674678 -1.267505 -0.399572
C  1.986052 -0.706796 0.065681
H  2.182502 -0.92846 1.119956
H  2.847111 -1.03845 -0.522508
C  1.794562 0.831305 -0.124794
H  1.827905 1.09374 -1.188121
H  2.60313 1.378652 0.367074
C  0.43603 1.331021 0.498964
C  -0.756126 1.274329 -0.341632
H  0.514934 -1.190703 -1.479599
H  -1.830908 -1.140468 -1.246178
H  0.252192 0.883196 1.477837
H  -0.656344 1.63153 -1.371179
H  -2.870792 0.992593 -0.524369
H  0.55422 2.42617 0.663402
H  -0.317628 -1.44888 1.463053
e0: -310.290390933 hartree
corrType: DLPNO BASED
e0: -310.304114395 hartree
basis: def2-TZVPP def2-QZVPP
scfener: -310.290390933 -310.304114395
corrmethod: MDCI MDCI
correner: -1.447314096 -1.517801276
corrcbsextra: -1.570013963
energy: -311.876018610380
dipole: 0.28519 -1.11291 -0.82772 1.94750 -0.53599 1.41151 0.22951 -0.44596 -0.21645
magnitude: 1.65056 au
magnitude: 4.19538 debye
