program: Orca
programVersion: 5.0.3
elementType: C H C H C C C H H C H H C C H H H H H H H
charge: 1
multiplicity: 1
keywords: DSD-PBEP86 cc-pVTZ EnGrad D3BJ RIJCOSX verytightscf cc-pVTZ/C def2/J soscf
formula: C8H13
InChI: InChI=1/C8H13/c1-2-4-6-8-7-5-3-1/h1-2,7H,3-6,8H2
21 atoms
C  -1.9971 0.75276 0.073295
H  -2.174261 0.849358 1.147552
C  -1.736968 -0.952177 -0.151517
H  -2.618426 -1.321147 0.377849
C  -0.422599 -1.379249 0.398222
C  0.690412 -1.281616 -0.370565
C  2.004534 -0.688282 0.064893
H  2.215661 -0.879815 1.122702
H  2.857545 -1.030139 -0.526602
C  1.793887 0.876356 -0.144525
H  1.84586 1.127444 -1.209335
H  2.60069 1.417798 0.355504
C  0.421839 1.252398 0.472101
C  -0.764132 1.311616 -0.37941
H  0.526861 -1.211509 -1.4506
H  -1.839856 -1.122361 -1.223863
H  0.153556 0.42416 1.142329
H  -0.649164 1.499546 -1.450531
H  -2.877316 0.984639 -0.525568
H  0.424624 2.073921 1.214157
H  -0.34279 -1.501821 1.478972
totalener: -311.08769878 hartree
nucrepener: 380.02560564 hartree
electener: -691.11330441 hartree
oneelecener: -1160.40170238 hartree
twoeener: 469.28839797 hartree
kineticenergy: 309.71896152 hartree
exchangeener: -13.661205452960 hartree
correlationener: -0.922203381025 hartree
xcener: -14.583408833985 hartree
chargesum: 1.0000000
charge: -0.258516 0.196620 -0.247251 0.200246 -0.147059 -0.122202 -0.236872 0.156406 0.175036 -0.261726 0.161028 0.179235 -0.244530 0.103536 0.165612 0.189688 0.152452 0.224854 0.203233 0.224962 0.185248
charge: 0.129715 0.012575 0.166209 0.009041 0.020539 0.077050 0.079093 -0.005348 -0.004073 0.106810 -0.012925 -0.002057 0.078314 0.310502 -0.017100 -0.000848 0.006776 0.015820 0.007641 0.041135 -0.018869
qa: -0.2585 0.1966 -0.2473 0.2002 -0.1471 -0.1222 -0.2369 0.1564 0.1750 -0.2617 0.1610 0.1792 -0.2445 0.1035 0.1656 0.1897 0.1525 0.2249 0.2032 0.2250 0.1852
va: 3.8876 0.9723 3.9183 0.9655 3.8276 3.8430 3.9067 0.9869 0.9763 3.8940 0.9843 0.9759 3.8715 3.5682 0.9827 0.9727 1.0179 0.9619 0.9706 0.9626 0.9826
dispcorr: -0.011968127 hartree
energy: -311.795250624826
dipole: 0.11512 -0.99581 -0.88069 1.22673 -0.21588 1.01085 0.42395 -0.51333 -0.08938
magnitude: 1.34367 au
magnitude: 3.41533 debye
