program: Orca
programVersion: 5.0.3
elementType: C H C H C C C H H C H H C C H H H H H H H
charge: 1
multiplicity: 1
keywords: PBE0 def2-TZVP EnGrad RIJCOSX verytightscf def2/J soscf
formula: C8H13
InChI: InChI=1/C8H13/c1-2-4-6-8-7-5-3-1/h1-2,7H,3-6,8H2
21 atoms
C  -1.995592 0.536343 0.119336
H  -2.171866 0.725874 1.18184
C  -1.935381 -0.990846 -0.172773
H  -2.673747 -1.577128 0.377426
C  -0.505408 -1.171988 0.291231
C  0.616344 -1.144995 -0.495929
C  1.91024 -0.659857 0.068043
H  2.018524 -0.951448 1.118126
H  2.770736 -1.042938 -0.487654
C  1.880502 0.902986 -0.0461
H  1.98767 1.187981 -1.099487
H  2.731187 1.33338 0.489063
C  0.548584 1.48073 0.496225
C  -0.569224 0.884104 -0.275686
H  0.533183 -1.306675 -1.570344
H  -2.03979 -1.19383 -1.242933
H  0.426623 1.333614 1.573945
H  -0.435906 0.949794 -1.358518
H  -2.736858 1.082477 -0.473926
H  0.54894 2.568487 0.310565
H  -0.35808 -1.124046 1.371663
totalener: -312.08118202 hartree
nucrepener: 384.43807379 hartree
electener: -696.51925581 hartree
oneelecener: -1169.79804430 hartree
twoeener: 473.27878848 hartree
kineticenergy: 310.17001015 hartree
exchangeener: -34.184566154332 hartree
correlationener: -1.971849153078 hartree
xcener: -36.156415307410 hartree
chargesum: 1.0000000
charge: -0.193403 0.163448 -0.198583 0.176772 -0.070565 -0.075461 -0.221717 0.161051 0.176127 -0.243631 0.157375 0.176464 -0.177889 -0.061766 0.190497 0.160441 0.153816 0.188305 0.177306 0.190194 0.171220
charge: -0.204637 0.159222 -0.197936 0.155509 -0.061338 -0.054932 -0.216082 0.160056 0.164053 -0.212851 0.153485 0.157181 -0.230425 0.050112 0.166439 0.158358 0.159008 0.174194 0.160377 0.188267 0.171940
qa: -0.1934 0.1634 -0.1986 0.1768 -0.0706 -0.0755 -0.2217 0.1611 0.1761 -0.2436 0.1574 0.1765 -0.1779 -0.0618 0.1905 0.1604 0.1538 0.1883 0.1773 0.1902 0.1712
va: 3.9214 0.9740 3.9121 0.9704 3.9223 3.8943 3.9576 0.9682 0.9685 3.9411 0.9695 0.9639 3.9573 3.8485 0.9529 0.9738 0.9731 0.9518 0.9690 0.9621 0.9625
energy: -312.081182018825
dipole: 0.56285 -0.76053 -0.19768 1.85862 -1.59097 0.26765 0.17767 -0.31631 -0.13864
magnitude: 0.36046 au
magnitude: 0.91622 debye
